{"text_format":"1","workbook":"xlsx","n_sheets":3,"sheets":["REF","Prog","Freq"],"not_rendered":{"charts":0,"images":0,"macros":1,"external_links":0,"defined_names":4,"comments":0,"pivot_tables":1},"unopened":[],"bounds":{"document_bytes":16777216,"sheet_cells":100000,"rows_first":2000,"rows_last":500,"rows_between":2000,"halvings":0,"cell_chars":16384,"cell_head_chars":4096},"cells_cut":0,"cells_raw":0,"read":"whole","date_system":"1900"}

{"sheet":"REF","index":0,"n_rows":50,"n_cols":7,"rows_kept":50,"cut":false,"hidden":true,"merged":[]}
["AAA","ANAA",null,null,null,"LUN","LUNDI"]
["AHE","AHE",null,null,null,"MAR","MARDI"]
["APK","APATAKI",null,null,null,"MER","MERCREDI"]
["AUQ","HIVA OA (ATUONA)",null,null,null,"JEU","JEUDI"]
["AXR","ARUTUA",null,null,null,"VEN","VENDREDI"]
["BOB","BORA BORA",null,null,null,"SAM","SAMEDI"]
["FAC","FAAITE",null,null,null,"DIM","DIMANCHE"]
["FAV","FAKARAVA"]
["FGU","FANGATAU"]
["FHZ","FAKAHINA"]
["GMR","GAMBIER"]
["HHZ","HIKUERU"]
["HOI","HAO"]
["HUH","HUAHINE"]
["KHZ","KAUEHI"]
["KKR","KAUKURA"]
["KXU","KATIU"]
["MAU","MAUPITI"]
["MKP","MAKEMO"]
["MOZ","MOOREA"]
["MVT","MATAIVA"]
["NAU","NAPUKA"]
["NHV","NUKU HIVA"]
["NIU","NIAU"]
["NUK","NUKUTAVAKE"]
["PKP","PUKAPUKA"]
["PPT","TAHITI"]
["PUK","PUKARUA"]
["RAR","RAROTONGA"]
["REA","REAO"]
["RFP","RAIATEA"]
["RGI","RANGIROA"]
["RKA","ARATIKA"]
["RMT","RIMATARA"]
["RRR","RAROIA"]
["RUR","RURUTU"]
["RVV","RAIVAVAE"]
["TIH","TIKEHAU"]
["TJN","TAKUME"]
["TKP","TAKAPOTO"]
["TKV","TATAKOTO"]
["TKX","TAKAROA"]
["TPX","TUPAI"]
["TUB","TUBUAI"]
["UAH","UA HUKA"]
["UAP","UA POU"]
["UOA","MORUROA"]
["VHZ","VAHITAHI"]
["XMH","MANIHI"]
["ZTA","TUREIA"]

{"sheet":"Prog","index":1,"n_rows":784,"n_cols":12,"rows_kept":784,"cut":false,"hidden":false,"merged":[]}
["AIR TAHITI FLIGHTS SCHEDULES - WINTER 2021 / PROGRAMME DE VOL AIR TAHITI - HIVER 2021"]
["From November 12th 2021 to April 20th 2022 / Valable du 12 novembre 2021 au 20 avril 2022"]
["Dates and time schedules can be subject to modifications /  Dates et Horaires indicatifs et susceptibles d'être modifiés sans préavis"]
[]
["Stop :"]
["#  = Aircraft change / Changement d'appareil"]
[]
["Aircraft / Appareil :"]
["ATR = ATR 72 ou ATR 42"]
[]
["Decoded Island Pair\nRelation décodée","From \nDe","To\nVers","Island Pair\nRelation","Day\nJour","Departure\nDépart","Arrival\nArrivée ","Flight(s)\nVol(s)","Stop","Validity\nValidité ","Flight duration\nDurée du vol ","Aircraft\nAppareil"]
[{"$f":" CONCATENATE(VLOOKUP(B12,esc,2,0),\" - \",VLOOKUP(C12,esc,2,0))","v":"TAHITI - NUKU HIVA"},"PPT","NHV",{"$f":"CONCATENATE(B12,C12)","v":"PPTNHV"},"Monday / Lundi",0.33333333333333331,0.48958333333333331,"823","0","13,20,27dec; 03jan; 21feb; 04,11,18apr",0.1354166716337204,"ATR"]
["TAHITI - HIVA OA (ATUONA)","PPT","AUQ","PPTAUQ","Monday / Lundi",0.33333333333333331,0.54861111111111105,"823","1","13,20,27dec; 03jan; 21feb; 04,11,18apr",0.1944444477558136,"ATR"]
["TAHITI - HUAHINE","PPT","HUH","PPTHUH","Monday / Lundi",0.27083333333333331,0.2986111111111111,"360","0",null,2.777777798473835E-2,"ATR"]
["TAHITI - RAIATEA","PPT","RFP","PPTRFP","Monday / Lundi",0.27083333333333331,0.3263888888888889,"360","1",null,5.55555559694767E-2,"ATR"]
["TAHITI - BORA BORA","PPT","BOB","PPTBOB","Monday / Lundi",0.27430558696640861,0.3090278257454766,"0401","0",null,3.4722223877906799E-2,"ATR"]
["TAHITI - RAIATEA","PPT","RFP","PPTRFP","Monday / Lundi",0.28125,0.3125,"492","0",null,3.125E-2,"ATR"]
["TAHITI - BORA BORA","PPT","BOB","PPTBOB","Monday / Lundi",0.28125,0.34375003472222221,"492","1",null,5.9027776122093201E-2,"ATR"]
["HUAHINE - RAIATEA","HUH","RFP","HUHRFP","Monday / Lundi",0.3125,0.3263888888888889,"360","0",null,1.3888888992369175E-2,"ATR"]
["TAHITI - RAIATEA","PPT","RFP","PPTRFP","Monday / Lundi",0.30555558696640861,0.33680558696640861,"354","0","13,20,27dec; 03jan; 04,11,18apr",3.125E-2,"ATR"]
["HUAHINE - TAHITI","HUH","PPT","HUHPPT","Monday / Lundi",0.3125,0.37152777777777773,"360","1",null,6.5972223877906799E-2,"ATR"]
["TAHITI - BORA BORA","PPT","BOB","PPTBOB","Monday / Lundi",0.31944448247803581,0.35416669145478141,"445","0",null,3.4722223877906799E-2,"ATR"]
["TAHITI - HUAHINE","PPT","HUH","PPTHUH","Monday / Lundi",0.31944448247803581,0.38541669145478141,"445","1",null,6.5972223877906799E-2,"ATR"]
["BORA BORA - TAHITI","BOB","PPT","BOBPPT","Monday / Lundi",0.32291669145478141,0.35763893023384941,"0401","0",null,3.4722223877906799E-2,"ATR"]
["RAIATEA - BORA BORA","RFP","BOB","RFPBOB","Monday / Lundi",0.32986113921059501,0.34375003472222221,"492","0",null,1.3888888992369175E-2,"ATR"]
["RAIATEA - TAHITI","RFP","PPT","RFPPPT","Monday / Lundi",0.32986113921059501,0.39236113921059501,"492","1",null,6.25E-2,"ATR"]
["TAHITI - TUBUAI","PPT","TUB","PPTTUB","Monday / Lundi",0.25,0.31944444444444448,"938","0",null,6.9444447755813599E-2,"ATR"]
["TAHITI - RURUTU","PPT","RUR","PPTRUR","Monday / Lundi",0.25,0.37152777777777773,"938","1",null,0.1215277761220932,"ATR"]
["RAIATEA - TAHITI","RFP","PPT","RFPPPT","Monday / Lundi",0.34027777777777773,0.37152777777777773,"360","0",null,3.125E-2,"ATR"]
["RAIATEA - TAHITI","RFP","PPT","RFPPPT","Monday / Lundi",0.35069448247803581,0.38194448247803581,"354","0","13,20,27dec; 03jan; 04,11,18apr",3.125E-2,"ATR"]
["TAHITI - NUKU HIVA","PPT","NHV","PPTNHV","Monday / Lundi",0.35416669145478141,0.5104167212571038,"0823","0","Except. 13,20,27dec; 03jan; 21feb; 04,11,18apr",0.1354166716337204,"ATR"]
["TAHITI - HIVA OA (ATUONA)","PPT","AUQ","PPTAUQ","Monday / Lundi",0.35416669145478141,0.56944445267571342,"0823","1","Except. 13,20,27dec; 03jan; 21feb; 04,11,18apr",0.1944444477558136,"ATR"]
["BORA BORA - TAHITI","BOB","PPT","BOBPPT","Monday / Lundi",0.35763893023384941,0.39236113921059501,"492","0",null,3.4722223877906799E-2,"ATR"]
["BORA BORA - FAKARAVA","BOB","FAV","BOBFAV","Monday / Lundi",0.35763893023384941,0.64583334818734062,"0492/0584","1#",null,0.2881944477558136,"ATR/ATR"]
["BORA BORA - HUAHINE","BOB","HUH","BOBHUH","Monday / Lundi",0.36805558696640861,0.38541669145478141,"445","0",null,1.73611119389534E-2,"ATR"]
["BORA BORA - TAHITI","BOB","PPT","BOBPPT","Monday / Lundi",0.36805558696640861,0.427083377989663,"445","1",null,5.9027776122093201E-2,"ATR"]
["TAHITI - RANGIROA","PPT","RGI","PPTRGI","Monday / Lundi",0.39236113921059501,0.4340278257454766,"0537","0","13,20,27dec; 03jan; 04,11,18apr",4.1666667908430099E-2,"ATR"]
["TAHITI - FAKARAVA","PPT","FAV","PPTFAV","Monday / Lundi",0.39236113921059501,0.48611113921059501,"0537","1","13,20,27dec; 03jan; 04,11,18apr",9.375E-2,"ATR"]
["HUAHINE - TAHITI","HUH","PPT","HUHPPT","Monday / Lundi",0.39930558696640861,0.427083377989663,"445","0",null,2.777777798473835E-2,"ATR"]
["NUKU HIVA - HIVA OA (ATUONA)","NHV","AUQ","NHVAUQ","Monday / Lundi",0.52083333333333337,0.54861111111111105,"823","0","13,20,27dec; 03jan; 21feb; 04,11,18apr",2.777777798473835E-2,"ATR"]
["NUKU HIVA - TAHITI","NHV","PPT","NHVPPT","Monday / Lundi",0.52083333333333337,0.6875,"823","1","13,20,27dec; 03jan; 21feb; 04,11,18apr",0.1875,"ATR"]
["TUBUAI - RURUTU","TUB","RUR","TUBRUR","Monday / Lundi",0.34027777777777773,0.37152777777777773,"938","0",null,3.125E-2,"ATR"]
["TUBUAI - TAHITI","TUB","PPT","TUBPPT","Monday / Lundi",0.34027777777777773,0.4548611111111111,"938","1",null,0.1145833358168602,"ATR"]
["TAHITI - HUAHINE","PPT","HUH","PPTHUH","Monday / Lundi",0.44791669145478141,0.47569448247803581,"476","0",null,2.777777798473835E-2,"ATR"]
["TAHITI - BORA BORA","PPT","BOB","PPTBOB","Monday / Lundi",0.44791669145478141,0.50694445267571342,"476","1",null,5.9027776122093201E-2,"ATR"]
["RANGIROA - FAKARAVA","RGI","FAV","RGIFAV","Monday / Lundi",0.45486113921059501,0.48611113921059501,"0537","0","13,20,27dec; 03jan; 04,11,18apr",3.125E-2,"ATR"]
["RANGIROA - TAHITI","RGI","PPT","RGIPPT","Monday / Lundi",0.45486113921059501,0.55208334818734062,"0537","1","13,20,27dec; 03jan; 04,11,18apr",9.7222223877906799E-2,"ATR"]
["HIVA OA (ATUONA) - TAHITI","AUQ","PPT","AUQPPT","Monday / Lundi",0.56944444444444442,0.6875,"823","0","13,20,27dec; 03jan; 21feb; 04,11,18apr",0.1388888955116272,"ATR"]
["TAHITI - TIKEHAU","PPT","TIH","PPTTIH","Monday / Lundi",0.4375,0.47569444444444442,"566","0",null,3.81944440305233E-2,"ATR"]
["TAHITI - RANGIROA","PPT","RGI","PPTRGI","Monday / Lundi",0.4375,0.50347222222222221,"566","1",null,6.5972223877906799E-2,"ATR"]
["RURUTU - TAHITI","RUR","PPT","RURPPT","Monday / Lundi",0.3923611111111111,0.4548611111111111,"938","0",null,6.25E-2,"ATR"]
["HUAHINE - BORA BORA","HUH","BOB","HUHBOB","Monday / Lundi",0.489583377989663,0.50694445267571342,"476","0",null,1.73611119389534E-2,"ATR"]
["HUAHINE - TAHITI","HUH","PPT","HUHPPT","Monday / Lundi",0.489583377989663,0.555555616768731,"476","1",null,6.5972223877906799E-2,"ATR"]
["FAKARAVA - TAHITI","FAV","PPT","FAVPPT","Monday / Lundi",0.50000003472222221,0.55208334818734062,"0537","0","13,20,27dec; 03jan; 04,11,18apr",5.2083332091569901E-2,"ATR"]
["TIKEHAU - RANGIROA","TIH","RGI","TIHRGI","Monday / Lundi",0.48958333333333331,0.50347222222222221,"566","0",null,1.3888888992369175E-2,"ATR"]
["TIKEHAU - TAHITI","TIH","PPT","TIHPPT","Monday / Lundi",0.48958333333333331,0.56597222222222221,"566","1",null,7.63888880610466E-2,"ATR"]
["BORA BORA - TAHITI","BOB","PPT","BOBPPT","Monday / Lundi",0.52083334818734062,0.555555616768731,"476","0",null,3.4722223877906799E-2,"ATR"]
["NUKU HIVA - HIVA OA (ATUONA)","NHV","AUQ","NHVAUQ","Monday / Lundi",0.5416667212571038,0.56944445267571342,"0823","0","Except. 13,20,27dec; 03jan; 21feb; 04,11,18apr",2.777777798473835E-2,"ATR"]
["TAHITI - TUBUAI","PPT","TUB","PPTTUB","Monday / Lundi",0.5416667212571038,0.61111113921059501,"921","0","13,20,27dec; 03jan; 21feb; 04,11,18apr",6.9444447755813599E-2,"ATR"]
["TAHITI - RAIVAVAE","PPT","RVV","PPTRVV","Monday / Lundi",0.5416667212571038,0.65972224369896781,"921","1","13,20,27dec; 03jan; 21feb; 04,11,18apr",0.1180555522441864,"ATR"]
["NUKU HIVA - TAHITI","NHV","PPT","NHVPPT","Monday / Lundi",0.5416667212571038,0.70833334818734062,"0823","1","Except. 13,20,27dec; 03jan; 21feb; 04,11,18apr",0.1875,"ATR"]
["RANGIROA - TAHITI","RGI","PPT","RGIPPT","Monday / Lundi",0.52430555555555558,0.56597222222222221,"566","0",null,4.1666667908430099E-2,"ATR"]
["TAHITI - MOOREA","PPT","MOZ","PPTMOZ","Monday / Lundi",0.55208334818734062,0.56250003472222221,"234","0",null,1.0416666977107525E-2,"ATR"]
["TAHITI - BORA BORA","PPT","BOB","PPTBOB","Monday / Lundi",0.55208334818734062,0.61458334818734062,"234","1",null,6.25E-2,"ATR"]
["TAHITI - RAIATEA","PPT","RFP","PPTRFP","Monday / Lundi",0.55208334818734062,0.649305616768731,"234","2",null,9.7222223877906799E-2,"ATR"]
["TAHITI - MAUPITI","PPT","MAU","PPTMAU","Monday / Lundi",0.56250003472222221,0.60069445267571342,"747","0","13,20,27dec; 03jan; 04,11,18apr",3.81944440305233E-2,"ATR"]
["TAHITI - BORA BORA","PPT","BOB","PPTBOB","Monday / Lundi",0.57638893023384941,0.61111113921059501,"0489","0",null,3.4722223877906799E-2,"ATR"]
["TAHITI - MOOREA","PPT","MOZ","PPTMOZ","Monday / Lundi",0.57638893023384941,0.65625003472222221,"0489","1",null,7.98611119389534E-2,"ATR"]
["MOOREA - BORA BORA","MOZ","BOB","MOZBOB","Monday / Lundi",0.57986113921059501,0.61458334818734062,"234","0",null,3.4722223877906799E-2,"ATR"]
["MOOREA - RAIATEA","MOZ","RFP","MOZRFP","Monday / Lundi",0.57986113921059501,0.649305616768731,"234","1",null,6.9444447755813599E-2,"ATR"]
["TAHITI - RURUTU","PPT","RUR","PPTRUR","Monday / Lundi",0.586805616768731,0.64583334818734062,"935","0","13,20,27dec; 03jan; 21feb; 04,11,18apr",5.9027776122093201E-2,"ATR"]
["TAHITI - RIMATARA","PPT","RMT","PPTRMT","Monday / Lundi",0.586805616768731,0.69097224369896781,"935","1","13,20,27dec; 03jan; 21feb; 04,11,18apr",0.1041666641831398,"ATR"]
["HIVA OA (ATUONA) - TAHITI","AUQ","PPT","AUQPPT","Monday / Lundi",0.5902778257454766,0.70833334818734062,"0823","0","Except. 13,20,27dec; 03jan; 21feb; 04,11,18apr",0.1388888955116272,"ATR"]
["TAHITI - FAKARAVA","PPT","FAV","PPTFAV","Monday / Lundi",0.57638888888888895,0.625,"584","0",null,4.86111119389534E-2,"ATR"]
["TAHITI - RANGIROA","PPT","RGI","PPTRGI","Monday / Lundi",0.57638888888888895,0.67708333333333337,"584","1",null,0.1006944477558136,"ATR"]
[{"$f":" CONCATENATE(VLOOKUP(B76,esc,2,0),\" - \",VLOOKUP(C76,esc,2,0))","v":"HAO - TAHITI"},"HOI","PPT",{"$f":"CONCATENATE(B76,C76)","v":"HOIPPT"},"Monday / Lundi",0.60763893023384941,0.6979167212571038,"940","0","Except. 15nov; 06,27dec; 17,24jan; 14,21feb; 14,21,28mar",9.0277776122093201E-2,"ATR"]
["MAUPITI - TAHITI","MAU","PPT","MAUPPT","Monday / Lundi",0.61458334818734062,0.649305616768731,"747","0","13,20,27dec; 03jan; 04,11,18apr",3.4722223877906799E-2,"ATR"]
["BORA BORA - MOOREA","BOB","MOZ","BOBMOZ","Monday / Lundi",0.62500003472222221,0.65625003472222221,"0489","0",null,3.125E-2,"ATR"]
["BORA BORA - TAHITI","BOB","PPT","BOBPPT","Monday / Lundi",0.62500003472222221,0.680555616768731,"0489","1",null,5.55555559694767E-2,"ATR"]
["TUBUAI - RAIVAVAE","TUB","RVV","TUBRVV","Monday / Lundi",0.63194445267571342,0.65972224369896781,"921","0","13,20,27dec; 03jan; 21feb; 04,11,18apr",2.777777798473835E-2,"ATR"]
["TUBUAI - TAHITI","TUB","PPT","TUBPPT","Monday / Lundi",0.63194445267571342,0.75000003472222221,"921","1","13,20,27dec; 03jan; 21feb; 04,11,18apr",0.1180555522441864,"ATR"]
["BORA BORA - RAIATEA","BOB","RFP","BOBRFP","Monday / Lundi",0.6354167212571038,0.649305616768731,"234","0",null,1.3888888992369175E-2,"ATR"]
["TAHITI - RAIATEA","PPT","RFP","PPTRFP","Monday / Lundi",0.60416666666666663,0.63541666666666663,"463","0","13,20,27dec; 03jan; 14,21,28mar; 04,11,18apr",3.125E-2,"ATR"]
["BORA BORA - TAHITI","BOB","PPT","BOBPPT","Monday / Lundi",0.6354167212571038,0.69444445267571342,"234","1",null,5.9027776122093201E-2,"ATR"]
["TAHITI - BORA BORA","PPT","BOB","PPTBOB","Monday / Lundi",0.60416666666666663,0.66319444444444442,"463","1","13,20,27dec; 03jan; 14,21,28mar; 04,11,18apr",5.9027776122093201E-2,"ATR"]
["TAHITI - HUAHINE","PPT","HUH","PPTHUH","Monday / Lundi",0.65972224369896781,0.68750003472222221,"315","0","Except. 15nov; 13,20,27dec; 03jan; 21feb; 21,28mar; 04,11,18apr",2.777777798473835E-2,"ATR"]
["TAHITI - RAIATEA","PPT","RFP","PPTRFP","Monday / Lundi",0.65972224369896781,0.7152778257454766,"315","1","Except. 15nov; 13,20,27dec; 03jan; 21feb; 21,28mar; 04,11,18apr",5.55555559694767E-2,"ATR"]
["RAIATEA - TAHITI","RFP","PPT","RFPPPT","Monday / Lundi",0.66319445267571342,0.69444445267571342,"234","0",null,3.125E-2,"ATR"]
["RURUTU - RIMATARA","RUR","RMT","RURRMT","Monday / Lundi",0.6666667212571038,0.69097224369896781,"935","0","13,20,27dec; 03jan; 21feb; 04,11,18apr",2.43055559694767E-2,"ATR"]
["FAKARAVA - RANGIROA","FAV","RGI","FAVRGI","Monday / Lundi",0.64583333333333337,0.67708333333333337,"584","0",null,3.125E-2,"ATR"]
["FAKARAVA - TAHITI","FAV","PPT","FAVPPT","Monday / Lundi",0.64583333333333337,0.73263888888888884,"584","1",null,8.6805552244186401E-2,"ATR"]
["RURUTU - TAHITI","RUR","PPT","RURPPT","Monday / Lundi",0.6666667212571038,0.77083334818734062,"935","1","13,20,27dec; 03jan; 21feb; 04,11,18apr",0.1041666641831398,"ATR"]
["MOOREA - TAHITI","MOZ","PPT","MOZPPT","Monday / Lundi",0.67013893023384941,0.680555616768731,"0489","0",null,1.0416666977107525E-2,"ATR"]
["RAIVAVAE - TAHITI","RVV","PPT","RVVPPT","Monday / Lundi",0.67361113921059501,0.75000003472222221,"921","0","13,20,27dec; 03jan; 21feb; 04,11,18apr",7.63888880610466E-2,"ATR"]
["RAIATEA - BORA BORA","RFP","BOB","RFPBOB","Monday / Lundi",0.64930555555555558,0.66319444444444442,"463","0","13,20,27dec; 03jan; 14,21,28mar; 04,11,18apr",1.3888888992369175E-2,"ATR"]
["RAIATEA - TAHITI","RFP","PPT","RFPPPT","Monday / Lundi",0.64930555555555558,0.71180555555555547,"463","1","13,20,27dec; 03jan; 14,21,28mar; 04,11,18apr",5.9027776122093201E-2,"ATR"]
["TAHITI - HUAHINE","PPT","HUH","PPTHUH","Monday / Lundi",0.68750003472222221,0.7152778257454766,"0608","0","03jan; 18apr",2.777777798473835E-2,"ATR"]
["HUAHINE - RAIATEA","HUH","RFP","HUHRFP","Monday / Lundi",0.70138893023384941,0.7152778257454766,"315","0","Except. 15nov; 13,20,27dec; 03jan; 21feb; 21,28mar; 04,11,18apr",1.3888888992369175E-2,"ATR"]
["TAHITI - HUAHINE","PPT","HUH","PPTHUH","Monday / Lundi",0.70833333333333337,0.73611111111111116,"427","0",null,2.777777798473835E-2,"ATR"]
["TAHITI - BORA BORA","PPT","BOB","PPTBOB","Monday / Lundi",0.70833333333333337,0.76736111111111116,"427","1",null,5.9027776122093201E-2,"ATR"]
["RIMATARA - TAHITI","RMT","PPT","RMTPPT","Monday / Lundi",0.70486113921059501,0.77083334818734062,"935","0","13,20,27dec; 03jan; 21feb; 04,11,18apr",6.5972223877906799E-2,"ATR"]
["BORA BORA - TAHITI","BOB","PPT","BOBPPT","Monday / Lundi",0.67708333333333337,0.71180555555555547,"463","0","13,20,27dec; 03jan; 14,21,28mar; 04,11,18apr",3.125E-2,"ATR"]
["RANGIROA - TAHITI","RGI","PPT","RGIPPT","Monday / Lundi",0.69097222222222221,0.73263888888888884,"584","0",null,4.1666667908430099E-2,"ATR"]
["TAHITI - BORA BORA","PPT","BOB","PPTBOB","Monday / Lundi",0.71875,0.75347222222222221,"418","0","13,20,27dec; 03jan; 04,11,18apr",3.4722223877906799E-2,"ATR"]
["HUAHINE - TAHITI","HUH","PPT","HUHPPT","Monday / Lundi",0.7291667212571038,0.75694445267571342,"0608","0","03jan; 18apr",2.777777798473835E-2,"ATR"]
["RAIATEA - HUAHINE","RFP","HUH","RFPHUH","Monday / Lundi",0.73611113921059501,0.75000003472222221,"372","0","Except. 15nov; 13,20,27dec; 03jan; 21feb; 21,28mar; 04,11,18apr",1.3888888992369175E-2,"ATR"]
["RAIATEA - TAHITI","RFP","PPT","RFPPPT","Monday / Lundi",0.73611113921059501,0.7916667212571038,"372","1","Except. 15nov; 13,20,27dec; 03jan; 21feb; 21,28mar; 04,11,18apr",5.55555559694767E-2,"ATR"]
["TAHITI - HUAHINE","PPT","HUH","PPTHUH","Monday / Lundi",0.743055616768731,0.77083334818734062,"315","0","13,20,27dec; 03jan; 21feb; 21,28mar; 04,11,18apr",2.777777798473835E-2,"ATR"]
["TAHITI - RAIATEA","PPT","RFP","PPTRFP","Monday / Lundi",0.743055616768731,0.79861113921059501,"315","1","13,20,27dec; 03jan; 21feb; 21,28mar; 04,11,18apr",5.55555559694767E-2,"ATR"]
["HUAHINE - BORA BORA","HUH","BOB","HUHBOB","Monday / Lundi",0.75,0.76736111111111116,"19:30","0",null,1.73611119389534E-2,"ATR"]
["HUAHINE - TAHITI","HUH","PPT","HUHPPT","Monday / Lundi",0.75,0.81250003472222221,"19:30","1",null,6.5972223877906799E-2,"ATR"]
["TAHITI - RAIATEA","PPT","RFP","PPTRFP","Monday / Lundi",0.7604167212571038,0.7916667212571038,"372","0","13,20,27dec; 03jan; 21feb; 21,28mar; 04,11,18apr",3.125E-2,"ATR"]
["TAHITI - HUAHINE","PPT","HUH","PPTHUH","Monday / Lundi",0.7604167212571038,0.81944445267571342,"372","1","13,20,27dec; 03jan; 21feb; 21,28mar; 04,11,18apr",5.9027776122093201E-2,"ATR"]
["HUAHINE - TAHITI","HUH","PPT","HUHPPT","Monday / Lundi",0.76388893023384941,0.7916667212571038,"372","0","Except. 15nov; 13,20,27dec; 03jan; 21feb; 21,28mar; 04,11,18apr",2.777777798473835E-2,"ATR"]
["BORA BORA - TAHITI","BOB","PPT","BOBPPT","Monday / Lundi",0.77083333333333337,0.80555555555555547,"418","0","13,20,27dec; 03jan; 04,11,18apr",3.4722223877906799E-2,"ATR"]
["BORA BORA - TAHITI","BOB","PPT","BOBPPT","Monday / Lundi",0.78125,0.81250003472222221,"427","0",null,3.4722223877906799E-2,"ATR"]
["HUAHINE - RAIATEA","HUH","RFP","HUHRFP","Monday / Lundi",0.78472224369896781,0.79861113921059501,"315","0","13,20,27dec; 03jan; 21feb; 21,28mar; 04,11,18apr",1.3888888992369175E-2,"ATR"]
["HUAHINE - TAHITI","HUH","PPT","HUHPPT","Monday / Lundi",0.78472224369896781,0.84722224369896781,"315","1","13,20,27dec; 03jan; 21feb; 21,28mar; 04,11,18apr",6.25E-2,"ATR"]
["RAIATEA - HUAHINE","RFP","HUH","RFPHUH","Monday / Lundi",0.805555616768731,0.81944445267571342,"372","0","13,20,27dec; 03jan; 21feb; 21,28mar; 04,11,18apr",1.3888888992369175E-2,"ATR"]
["RAIATEA - TAHITI","RFP","PPT","RFPPPT","Monday / Lundi",0.805555616768731,0.86111113921059501,"372","1","13,20,27dec; 03jan; 21feb; 21,28mar; 04,11,18apr",5.55555559694767E-2,"ATR"]
["RAIATEA - TAHITI","RFP","PPT","RFPPPT","Monday / Lundi",0.81597224369896781,0.84722224369896781,"315","0","13,20,27dec; 03jan; 21feb; 21,28mar; 04,11,18apr",3.125E-2,"ATR"]
["HUAHINE - TAHITI","HUH","PPT","HUHPPT","Monday / Lundi",0.83333334818734062,0.86111113921059501,"372","0","13,20,27dec; 03jan; 21feb; 21,28mar; 04,11,18apr",2.777777798473835E-2,"ATR"]
["TAHITI - NUKU HIVA","PPT","NHV","PPTNHV","Tuesday / Mardi",0.25000003472222221,0.40625003472222221,"830","0","Except. 18,25jan; 01,08feb",0.1354166716337204,"ATR"]
["TAHITI - HIVA OA (ATUONA)","PPT","AUQ","PPTAUQ","Tuesday / Mardi",0.25000003472222221,0.4652778257454766,"830","1","Except. 18,25jan; 01,08feb",0.1944444477558136,"ATR"]
["TAHITI - HAO","PPT","HOI","PPTHOI","Tuesday / Mardi",0.270833377989663,0.36111113921059501,"951","0","23nov; 14,28dec; 11,25jan; 08,22feb; 08,22mar; 05,19apr",9.0277776122093201E-2,"ATR"]
["TAHITI - GAMBIER","PPT","GMR","PPTGMR","Tuesday / Mardi",0.270833377989663,0.46875003472222221,"952","0","Except. 23nov; 14,28dec; 11,25jan; 08,22feb; 08,22mar; 05,19apr",0.15625,"ATR"]
["TAHITI - GAMBIER","PPT","GMR","PPTGMR","Tuesday / Mardi",0.270833377989663,0.50694445267571342,"951","1","23nov; 14,28dec; 11,25jan; 08,22feb; 08,22mar; 05,19apr",0.1944444477558136,"ATR"]
["TAHITI - HAO","PPT","HOI","PPTHOI","Tuesday / Mardi",0.270833377989663,0.54513893023384941,"0952","1","Except. 23nov; 14,28dec; 11,25jan; 08,22feb; 08,22mar; 05,19apr",0.2743055522441864,"ATR"]
["TAHITI - HUAHINE","PPT","HUH","PPTHUH","Tuesday / Mardi",0.28125003472222221,0.3090278257454766,"338","0",null,2.777777798473835E-2,"ATR"]
["TAHITI - RAIATEA","PPT","RFP","PPTRFP","Tuesday / Mardi",0.28125003472222221,0.33680558696640861,"338","1",null,5.55555559694767E-2,"ATR"]
["TAHITI - BORA BORA","PPT","BOB","PPTBOB","Tuesday / Mardi",0.29166669145478141,0.32638893023384941,"483","0","14dec; 04jan",3.4722223877906799E-2,"ATR"]
["TAHITI - HUAHINE","PPT","HUH","PPTHUH","Tuesday / Mardi",0.29166669145478141,0.35763893023384941,"483","1","14dec; 04jan",6.5972223877906799E-2,"ATR"]
["TAHITI - BORA BORA","PPT","BOB","PPTBOB","Tuesday / Mardi",0.302083377989663,0.33680558696640861,"479","0",null,3.4722223877906799E-2,"ATR"]
["TAHITI - RAIATEA","PPT","RFP","PPTRFP","Tuesday / Mardi",0.302083377989663,0.364583377989663,"479","1",null,6.25E-2,"ATR"]
["HUAHINE - RAIATEA","HUH","RFP","HUHRFP","Tuesday / Mardi",0.32291669145478141,0.33680558696640861,"338","0",null,1.3888888992369175E-2,"ATR"]
["TAHITI - RANGIROA","PPT","RGI","PPTRGI","Tuesday / Mardi",0.32291669145478141,0.364583377989663,"527","0","14,21,28dec; 04jan; 05,12apr",4.1666667908430099E-2,"ATR"]
["HUAHINE - TAHITI","HUH","PPT","HUHPPT","Tuesday / Mardi",0.32291669145478141,0.38194448247803581,"338","1",null,5.9027776122093201E-2,"ATR"]
["TAHITI - FAKARAVA","PPT","FAV","PPTFAV","Tuesday / Mardi",0.32291669145478141,0.41666669145478141,"527","1","14,21,28dec; 04jan; 05,12apr",9.375E-2,"ATR"]
["TAHITI - TAKAPOTO","PPT","TKP","PPTTKP","Tuesday / Mardi",0.333333377989663,0.38888893023384941,"571","0",null,5.55555559694767E-2,"ATR"]
[{"$f":" CONCATENATE(VLOOKUP(B140,esc,2,0),\" - \",VLOOKUP(C140,esc,2,0))","v":"TAHITI - TAKAROA"},"PPT","TKX",{"$f":"CONCATENATE(B140,C140)","v":"PPTTKX"},"Tuesday / Mardi",0.333333377989663,0.41319448247803581,"571","1",null,7.98611119389534E-2,"ATR"]
["BORA BORA - HUAHINE","BOB","HUH","BOBHUH","Tuesday / Mardi",0.3402778257454766,0.35763893023384941,"483","0","14dec; 04jan",1.73611119389534E-2,"ATR"]
["BORA BORA - TAHITI","BOB","PPT","BOBPPT","Tuesday / Mardi",0.3402778257454766,0.39930558696640861,"483","1","14dec; 04jan",5.9027776122093201E-2,"ATR"]
["BORA BORA - RAIATEA","BOB","RFP","BOBRFP","Tuesday / Mardi",0.35069448247803581,0.364583377989663,"479","0",null,1.3888888992369175E-2,"ATR"]
["RAIATEA - TAHITI","RFP","PPT","RFPPPT","Tuesday / Mardi",0.35069448247803581,0.38194448247803581,"338","0",null,3.125E-2,"ATR"]
["BORA BORA - TAHITI","BOB","PPT","BOBPPT","Tuesday / Mardi",0.35069448247803581,0.40972224369896781,"479","1",null,5.9027776122093201E-2,"ATR"]
["BORA BORA - TIKEHAU","BOB","TIH","BOBTIH","Tuesday / Mardi",0.35069448247803581,0.47916669145478141,"0479/0502","2",null,0.1284722238779068,"ATR"]
["BORA BORA - RANGIROA","BOB","RGI","BOBRGI","Tuesday / Mardi",0.35069448247803581,0.50694445267571342,"0479/0502","3",null,0.15625,"ATR"]
["TAHITI - ARUTUA","PPT","AXR","PPTAXR","Tuesday / Mardi",0.364583377989663,0.41319448247803581,"589","0",null,4.86111119389534E-2,"ATR"]
["TAHITI - AHE","PPT","AHE","PPTAHE","Tuesday / Mardi",0.364583377989663,0.44444448247803581,"589","1",null,7.98611119389534E-2,"ATR"]
["TAHITI - MANIHI","PPT","XMH","PPTXMH","Tuesday / Mardi",0.364583377989663,0.4652778257454766,"589","2",null,0.1006944477558136,"ATR"]
["HUAHINE - TAHITI","HUH","PPT","HUHPPT","Tuesday / Mardi",0.3715278257454766,0.39930558696640861,"483","0","14dec; 04jan",2.777777798473835E-2,"ATR"]
["RAIATEA - TAHITI","RFP","PPT","RFPPPT","Tuesday / Mardi",0.37847224369896781,0.40972224369896781,"479","0",null,3.125E-2,"ATR"]
["RAIATEA - TIKEHAU","RFP","TIH","RFPTIH","Tuesday / Mardi",0.37847224369896781,0.47916669145478141,"0479/0502","1",null,0.1006944477558136,"ATR"]
["RAIATEA - RANGIROA","RFP","RGI","RFPRGI","Tuesday / Mardi",0.37847224369896781,0.50694445267571342,"0479/0502","2",null,0.1284722238779068,"ATR"]
["HAO - GAMBIER","HOI","GMR","HOIGMR","Tuesday / Mardi",0.38194448247803581,0.50694445267571342,"951","0","23nov; 14,28dec; 11,25jan; 08,22feb; 08,22mar; 05,19apr",8.3333335816860199E-2,"ATR"]
["RANGIROA - FAKARAVA","RGI","FAV","RGIFAV","Tuesday / Mardi",0.38541669145478141,0.41666669145478141,"527","0","14,21,28dec; 04jan; 05,12apr",3.125E-2,"ATR"]
["RANGIROA - TAHITI","RGI","PPT","RGIPPT","Tuesday / Mardi",0.38541669145478141,0.48263893023384941,"527","1","14,21,28dec; 04jan; 05,12apr",9.7222223877906799E-2,"ATR"]
["TAKAPOTO - TAHITI","TKP","PPT","TKPPPT","Tuesday / Mardi",0.4027778257454766,0.49305558696640861,"571","1",null,9.0277776122093201E-2,"ATR"]
["TAHITI - RAIATEA","PPT","RFP","PPTRFP","Tuesday / Mardi",0.40625003472222221,0.43750003472222221,"416","0",null,3.125E-2,"ATR"]
["TAHITI - BORA BORA","PPT","BOB","PPTBOB","Tuesday / Mardi",0.40625003472222221,0.4652778257454766,"416","1",null,5.9027776122093201E-2,"ATR"]
["TAHITI - MOOREA","PPT","MOZ","PPTMOZ","Tuesday / Mardi",0.42013893023384941,0.43055558696640861,"266","0",null,1.0416666977107525E-2,"ATR"]
["TAHITI - HUAHINE","PPT","HUH","PPTHUH","Tuesday / Mardi",0.42013893023384941,0.46875003472222221,"266","1",null,4.86111119389534E-2,"ATR"]
["TAHITI - BORA BORA","PPT","BOB","PPTBOB","Tuesday / Mardi",0.42013893023384941,0.50000003472222221,"266","2",null,7.98611119389534E-2,"ATR"]
["ARUTUA - TAHITI","AXR","PPT","AXRPPT","Tuesday / Mardi",0.427083377989663,0.53472224369896781,"589","2",null,0.1076388880610466,"ATR"]
["FAKARAVA - TAHITI","FAV","PPT","FAVPPT","Tuesday / Mardi",0.43055558696640861,0.48263893023384941,"527","0","14,21,28dec; 04jan; 05,12apr",5.2083332091569901E-2,"ATR"]
["TAKAROA - TAHITI","TKX","PPT","TKXPPT","Tuesday / Mardi",0.4340278257454766,0.49305558696640861,"571","0",null,5.9027776122093201E-2,"ATR"]
["NUKU HIVA - HIVA OA (ATUONA)","NHV","AUQ","NHVAUQ","Tuesday / Mardi",0.43750003472222221,0.4652778257454766,"830","0","Except. 18,25jan; 01,08feb",2.777777798473835E-2,"ATR"]
["NUKU HIVA - TAHITI","NHV","PPT","NHVPPT","Tuesday / Mardi",0.43750003472222221,0.6041667212571038,"830","1","Except. 18,25jan; 01,08feb",0.1875,"ATR"]
["TAHITI - TIKEHAU","PPT","TIH","PPTTIH","Tuesday / Mardi",0.44097224369896781,0.47916669145478141,"502","0",null,3.81944440305233E-2,"ATR"]
["TAHITI - RANGIROA","PPT","RGI","PPTRGI","Tuesday / Mardi",0.44097224369896781,0.50694445267571342,"502","1",null,6.5972223877906799E-2,"ATR"]
["MOOREA - HUAHINE","MOZ","HUH","MOZHUH","Tuesday / Mardi",0.44444448247803581,0.46875003472222221,"266","0",null,2.43055559694767E-2,"ATR"]
["MOOREA - BORA BORA","MOZ","BOB","MOZBOB","Tuesday / Mardi",0.44444448247803581,0.50000003472222221,"266","1",null,5.55555559694767E-2,"ATR"]
["RAIATEA - BORA BORA","RFP","BOB","RFPBOB","Tuesday / Mardi",0.45138893023384941,0.4652778257454766,"416","0",null,1.3888888992369175E-2,"ATR"]
["RAIATEA - TAHITI","RFP","PPT","RFPPPT","Tuesday / Mardi",0.45138893023384941,0.51388893023384941,"416","1",null,6.25E-2,"ATR"]
["AHE - MANIHI","AHE","XMH","AHEXMH","Tuesday / Mardi",0.458333377989663,0.4652778257454766,"589","0",null,6.9444444961845875E-3,"ATR"]
["AHE - TAHITI","AHE","PPT","AHEPPT","Tuesday / Mardi",0.458333377989663,0.53472224369896781,"589","1",null,7.63888880610466E-2,"ATR"]
["BORA BORA - TAHITI","BOB","PPT","BOBPPT","Tuesday / Mardi",0.47916669145478141,0.51388893023384941,"416","0",null,3.4722223877906799E-2,"ATR"]
["MANIHI - TAHITI","XMH","PPT","XMHPPT","Tuesday / Mardi",0.47916669145478141,0.53472224369896781,"589","0",null,5.55555559694767E-2,"ATR"]
["HUAHINE - BORA BORA","HUH","BOB","HUHBOB","Tuesday / Mardi",0.48263893023384941,0.50000003472222221,"266","0",null,1.73611119389534E-2,"ATR"]
["HIVA OA (ATUONA) - TAHITI","AUQ","PPT","AUQPPT","Tuesday / Mardi",0.48611113921059501,0.6041667212571038,"830","0","Except. 18,25jan; 01,08feb",0.1388888955116272,"ATR"]
["TIKEHAU - RANGIROA","TIH","RGI","TIHRGI","Tuesday / Mardi",0.49305558696640861,0.50694445267571342,"502","0",null,1.3888888992369175E-2,"ATR"]
["TIKEHAU - TAHITI","TIH","PPT","TIHPPT","Tuesday / Mardi",0.49305558696640861,0.56944445267571342,"502","1",null,7.63888880610466E-2,"ATR"]
["GAMBIER - HAO","GMR","HOI","GMRHOI","Tuesday / Mardi",0.50000003472222221,0.54513893023384941,"952","0","Except. 23nov; 14,28dec; 11,25jan; 08,22feb; 08,22mar; 05,19apr",8.6805552244186401E-2,"ATR"]
["GAMBIER - TAHITI","GMR","PPT","GMRPPT","Tuesday / Mardi",0.50000003472222221,0.65972224369896781,"952","1","Except. 23nov; 14,28dec; 11,25jan; 08,22feb; 08,22mar; 05,19apr",0.2013888955116272,"ATR"]
["TAHITI - MAUPITI","PPT","MAU","PPTMAU","Tuesday / Mardi",0.51736113921059501,0.555555616768731,"736","0",null,3.81944440305233E-2,"ATR"]
["BORA BORA - HUAHINE","BOB","HUH","BOBHUH","Tuesday / Mardi",0.524305616768731,0.5416667212571038,"267","0",null,1.73611119389534E-2,"ATR"]
["BORA BORA - MOOREA","BOB","MOZ","BOBMOZ","Tuesday / Mardi",0.524305616768731,0.57986113921059501,"267","1",null,5.55555559694767E-2,"ATR"]
["BORA BORA - TAHITI","BOB","PPT","BOBPPT","Tuesday / Mardi",0.524305616768731,0.6041667212571038,"267","2",null,7.98611119389534E-2,"ATR"]
["RANGIROA - TAHITI","RGI","PPT","RGIPPT","Tuesday / Mardi",0.5277778257454766,0.56944445267571342,"502","0",null,4.1666667908430099E-2,"ATR"]
["GAMBIER - TAHITI","GMR","PPT","GMRPPT","Tuesday / Mardi",0.53819445267571342,0.66319445267571342,"951","0","23nov; 14,28dec; 11,25jan; 08,22feb; 08,22mar; 05,19apr",0.1666666716337204,"ATR"]
["TAHITI - RAIATEA","PPT","RFP","PPTRFP","Tuesday / Mardi",0.54513893023384941,0.57638893023384941,"447","0",null,3.125E-2,"ATR"]
["TAHITI - BORA BORA","PPT","BOB","PPTBOB","Tuesday / Mardi",0.54513893023384941,0.61111113921059501,"447","1",null,6.5972223877906799E-2,"ATR"]
["HUAHINE - MOOREA","HUH","MOZ","HUHMOZ","Tuesday / Mardi",0.555555616768731,0.57986113921059501,"267","0",null,2.43055559694767E-2,"ATR"]
["HUAHINE - TAHITI","HUH","PPT","HUHPPT","Tuesday / Mardi",0.555555616768731,0.6041667212571038,"267","1",null,4.86111119389534E-2,"ATR"]
["TAHITI - RAIATEA","PPT","RFP","PPTRFP","Tuesday / Mardi",0.56250003472222221,0.59375003472222221,"301","0","14,21,28dec; 04jan; 22feb; 05,12apr",3.125E-2,"ATR"]
["TAHITI - MAUPITI","PPT","MAU","PPTMAU","Tuesday / Mardi",0.56250003472222221,0.6354167212571038,"0301/0737","1#","14,21,28dec; 04jan; 22feb; 05,12apr",7.2916664183139801E-2,"ATR/ATR"]
["HAO - TAHITI","HOI","PPT","HOIPPT","Tuesday / Mardi",0.56597224369896781,0.65972224369896781,"952","0","Except. 23nov; 14,28dec; 11,25jan; 08,22feb; 08,22mar; 05,19apr",9.375E-2,"ATR"]
["MAUPITI - RAIATEA","MAU","RFP","MAURFP","Tuesday / Mardi",0.56944445267571342,0.586805616768731,"736","0",null,1.73611119389534E-2,"ATR"]
["MAUPITI - TAHITI","MAU","PPT","MAUPPT","Tuesday / Mardi",0.56944445267571342,0.63888893023384941,"0736/0301","1#","14,21,28dec; 04jan; 22feb; 05,12apr",6.9444447755813599E-2,"ATR/ATR"]
["MOOREA - TAHITI","MOZ","PPT","MOZPPT","Tuesday / Mardi",0.59375003472222221,0.6041667212571038,"267","0",null,1.0416666977107525E-2,"ATR"]
["RAIATEA - BORA BORA","RFP","BOB","RFPBOB","Tuesday / Mardi",0.59722224369896781,0.61111113921059501,"447","0",null,1.3888888992369175E-2,"ATR"]
["RAIATEA - TAHITI","RFP","PPT","RFPPPT","Tuesday / Mardi",0.59722224369896781,0.65972224369896781,"447","1",null,6.25E-2,"ATR"]
["RAIATEA - TAHITI","RFP","PPT","RFPPPT","Tuesday / Mardi",0.60763893023384941,0.63888893023384941,"301","0","14,21,28dec; 04jan; 22feb; 05,12apr",3.125E-2,"ATR"]
[{"$f":" CONCATENATE(VLOOKUP(B204,esc,2,0),\" - \",VLOOKUP(C204,esc,2,0))","v":"RAIATEA - MAUPITI"},"RFP","MAU",{"$f":"CONCATENATE(B204,C204)","v":"RFPMAU"},"Tuesday / Mardi",0.618055616768731,0.6354167212571038,"737","0",null,1.73611119389534E-2,"ATR"]
["TAHITI - HUAHINE","PPT","HUH","PPTHUH","Tuesday / Mardi",0.62500003472222221,0.6527778257454766,"373","0","14,21,28dec; 04jan; 22feb; 22,29mar; 05,12apr",2.777777798473835E-2,"ATR"]
["BORA BORA - TAHITI","BOB","PPT","BOBPPT","Tuesday / Mardi",0.62500003472222221,0.65972224369896781,"447","0",null,3.4722223877906799E-2,"ATR"]
["TAHITI - RAIATEA","PPT","RFP","PPTRFP","Tuesday / Mardi",0.62500003472222221,0.680555616768731,"373","1","14,21,28dec; 04jan; 22feb; 22,29mar; 05,12apr",5.55555559694767E-2,"ATR"]
["TAHITI - HUAHINE","PPT","HUH","PPTHUH","Tuesday / Mardi",0.6354167212571038,0.66319445267571342,"362","0","Except. 14,21,28dec; 04jan; 22feb; 22,29mar; 05,12apr",2.777777798473835E-2,"ATR"]
["TAHITI - RAIATEA","PPT","RFP","PPTRFP","Tuesday / Mardi",0.6354167212571038,0.69097224369896781,"362","1","Except. 14,21,28dec; 04jan; 22feb; 22,29mar; 05,12apr",5.55555559694767E-2,"ATR"]
["MAUPITI - TAHITI","MAU","PPT","MAUPPT","Tuesday / Mardi",0.649305616768731,0.6840278257454766,"737","0",null,3.4722223877906799E-2,"ATR"]
["TAHITI - HUAHINE","PPT","HUH","PPTHUH","Tuesday / Mardi",0.66319445267571342,0.69097224369896781,"422","0","Except. 11,18,25jan; 01,08,15,22feb; 01,08mar",2.777777798473835E-2,"ATR"]
["TAHITI - BORA BORA","PPT","BOB","PPTBOB","Tuesday / Mardi",0.66319445267571342,0.72222224369896781,"422","1","Except. 11,18,25jan; 01,08,15,22feb; 01,08mar",5.9027776122093201E-2,"ATR"]
["HUAHINE - RAIATEA","HUH","RFP","HUHRFP","Tuesday / Mardi",0.6666667212571038,0.680555616768731,"373","0","14,21,28dec; 04jan; 22feb; 22,29mar; 05,12apr",1.3888888992369175E-2,"ATR"]
["HUAHINE - TAHITI","HUH","PPT","HUHPPT","Tuesday / Mardi",0.6666667212571038,0.72569445267571342,"373","1","14,21,28dec; 04jan; 22feb; 22,29mar; 05,12apr",5.9027776122093201E-2,"ATR"]
["TAHITI - RAIATEA","PPT","RFP","PPTRFP","Tuesday / Mardi",0.67361113921059501,0.70486113921059501,"365","0","14,21,28dec; 04jan; 22feb; 22,29mar; 05,12apr",3.125E-2,"ATR"]
["TAHITI - HUAHINE","PPT","HUH","PPTHUH","Tuesday / Mardi",0.67361113921059501,0.73263893023384941,"365","1","14,21,28dec; 04jan; 22feb; 22,29mar; 05,12apr",5.9027776122093201E-2,"ATR"]
["HUAHINE - RAIATEA","HUH","RFP","HUHRFP","Tuesday / Mardi",0.67708334818734062,0.69097224369896781,"362","0","Except. 14,21,28dec; 04jan; 22feb; 22,29mar; 05,12apr",1.3888888992369175E-2,"ATR"]
["TAHITI - RAIATEA","PPT","RFP","PPTRFP","Tuesday / Mardi",0.69444445267571342,0.72569445267571342,"434","0",null,3.125E-2,"ATR"]
["RAIATEA - TAHITI","RFP","PPT","RFPPPT","Tuesday / Mardi",0.69444445267571342,0.72569445267571342,"373","0","14,21,28dec; 04jan; 22feb; 22,29mar; 05,12apr",3.125E-2,"ATR"]
["TAHITI - BORA BORA","PPT","BOB","PPTBOB","Tuesday / Mardi",0.69444445267571342,0.75347224369896781,"434","1",null,5.9027776122093201E-2,"ATR"]
["HUAHINE - BORA BORA","HUH","BOB","HUHBOB","Tuesday / Mardi",0.70486113921059501,0.72222224369896781,"422","0","Except. 11,18,25jan; 01,08,15,22feb; 01,08mar",1.73611119389534E-2,"ATR"]
["HUAHINE - TAHITI","HUH","PPT","HUHPPT","Tuesday / Mardi",0.70486113921059501,0.77083334818734062,"422","1","Except. 11,18,25jan; 01,08,15,22feb; 01,08mar",6.5972223877906799E-2,"ATR"]
["RAIATEA - HUAHINE","RFP","HUH","RFPHUH","Tuesday / Mardi",0.711805616768731,0.72569445267571342,"363","0","Except. 14,21,28dec; 04jan; 22feb; 22,29mar; 05,12apr",1.3888888992369175E-2,"ATR"]
["RAIATEA - TAHITI","RFP","PPT","RFPPPT","Tuesday / Mardi",0.711805616768731,0.76736113921059501,"363","1","Except. 14,21,28dec; 04jan; 22feb; 22,29mar; 05,12apr",5.55555559694767E-2,"ATR"]
["RAIATEA - HUAHINE","RFP","HUH","RFPHUH","Tuesday / Mardi",0.71875003472222221,0.73263893023384941,"365","0","14,21,28dec; 04jan; 22feb; 22,29mar; 05,12apr",1.3888888992369175E-2,"ATR"]
["RAIATEA - TAHITI","RFP","PPT","RFPPPT","Tuesday / Mardi",0.71875003472222221,0.774305616768731,"365","1","14,21,28dec; 04jan; 22feb; 22,29mar; 05,12apr",5.55555559694767E-2,"ATR"]
["BORA BORA - TAHITI","BOB","PPT","BOBPPT","Tuesday / Mardi",0.73611113921059501,0.77083334818734062,"422","0","Except. 11,18,25jan; 01,08,15,22feb; 01,08mar",3.4722223877906799E-2,"ATR"]
["RAIATEA - BORA BORA","RFP","BOB","RFPBOB","Tuesday / Mardi",0.73958334818734062,0.75347224369896781,"434","0",null,1.3888888992369175E-2,"ATR"]
["HUAHINE - TAHITI","HUH","PPT","HUHPPT","Tuesday / Mardi",0.73958334818734062,0.76736113921059501,"363","0","Except. 14,21,28dec; 04jan; 22feb; 22,29mar; 05,12apr",2.777777798473835E-2,"ATR"]
["RAIATEA - TAHITI","RFP","PPT","RFPPPT","Tuesday / Mardi",0.73958334818734062,0.80208334818734062,"434","1",null,6.25E-2,"ATR"]
["HUAHINE - TAHITI","HUH","PPT","HUHPPT","Tuesday / Mardi",0.7465278257454766,0.774305616768731,"365","0","14,21,28dec; 04jan; 22feb; 22,29mar; 05,12apr",2.777777798473835E-2,"ATR"]
["TAHITI - BORA BORA","PPT","BOB","PPTBOB","Tuesday / Mardi",0.75000003472222221,0.78472224369896781,"498","0","14,21,28dec; 04jan; 05,12apr",3.4722223877906799E-2,"ATR"]
["BORA BORA - TAHITI","BOB","PPT","BOBPPT","Tuesday / Mardi",0.76736113921059501,0.80208334818734062,"434","0",null,3.4722223877906799E-2,"ATR"]
["BORA BORA - TAHITI","BOB","PPT","BOBPPT","Tuesday / Mardi",0.79861113921059501,0.83333334818734062,"498","0","14,21,28dec; 04jan; 05,12apr",3.4722223877906799E-2,"ATR"]
["TAHITI - TUBUAI","PPT","TUB","PPTTUB","Wednesday / Mercredi",0.22916670635594261,0.29861113921059501,"939","0","15,22,29dec; 05jan; 06,13apr",6.9444447755813599E-2,"ATR"]
["TAHITI - RURUTU","PPT","RUR","PPTRUR","Wednesday / Mercredi",0.22916670635594261,0.35069448247803581,"939","1","15,22,29dec; 05jan; 06,13apr",0.1215277761220932,"ATR"]
["TAHITI - NUKU HIVA","PPT","NHV","PPTNHV","Wednesday / Mercredi",0.23958336308850181,0.395833377989663,"0832","0","15,22dec; 05jan; 23feb; 06,13apr",0.1354166716337204,"ATR"]
["TAHITI - HIVA OA (ATUONA)","PPT","AUQ","PPTAUQ","Wednesday / Mercredi",0.23958336308850181,0.45486113921059501,"0832","1","15,22dec; 05jan; 23feb; 06,13apr",0.1944444477558136,"ATR"]
["TAHITI - HIVA OA (ATUONA)","PPT","AUQ","PPTAUQ","Wednesday / Mercredi",0.25000003472222221,0.40972224369896781,"853","0",null,0.1388888955116272,"ATR"]
["TAHITI - NUKU HIVA","PPT","NHV","PPTNHV","Wednesday / Mercredi",0.25000003472222221,0.46180558696640861,"853","1",null,0.1909722238779068,"ATR"]
["TAHITI - TUBUAI","PPT","TUB","PPTTUB","Wednesday / Mercredi",0.270833377989663,0.3402778257454766,"916","0",null,6.9444447755813599E-2,"ATR"]
["TAHITI - RAIVAVAE","PPT","RVV","PPTRVV","Wednesday / Mercredi",0.270833377989663,0.38888893023384941,"916","1",null,0.1180555522441864,"ATR"]
["TAHITI - BORA BORA","PPT","BOB","PPTBOB","Wednesday / Mercredi",0.33333333333333331,0.36805555555555558,"408","0","Except. 12,19,26jan; 02,09,16feb; 02,09mar",3.4722223877906799E-2,"ATR"]
["TAHITI - HUAHINE","PPT","HUH","PPTHUH","Wednesday / Mercredi",0.31250003472222221,0.3402778257454766,"384","0",null,2.777777798473835E-2,"ATR"]
["TAHITI - RAIATEA","PPT","RFP","PPTRFP","Wednesday / Mercredi",0.31250003472222221,0.36805558696640861,"384","1",null,5.55555559694767E-2,"ATR"]
["TUBUAI - RURUTU","TUB","RUR","TUBRUR","Wednesday / Mercredi",0.31944448247803581,0.35069448247803581,"939","0","15,22,29dec; 05jan; 06,13apr",3.125E-2,"ATR"]
["TUBUAI - TAHITI","TUB","PPT","TUBPPT","Wednesday / Mercredi",0.31944448247803581,0.4340278257454766,"939","1","15,22,29dec; 05jan; 06,13apr",0.1145833358168602,"ATR"]
["TAHITI - BORA BORA","PPT","BOB","PPTBOB","Wednesday / Mercredi",0.32291669145478141,0.35763893023384941,"490","0",null,3.4722223877906799E-2,"ATR"]
["TAHITI - RAIATEA","PPT","RFP","PPTRFP","Wednesday / Mercredi",0.32291669145478141,0.38541669145478141,"490","1",null,6.25E-2,"ATR"]
["TAHITI - HUAHINE","PPT","HUH","PPTHUH","Wednesday / Mercredi",0.32291669145478141,0.41319448247803581,"490","2",null,9.0277776122093201E-2,"ATR"]
["BORA BORA - TAHITI","BOB","PPT","BOBPPT","Wednesday / Mercredi",0.38194444444444442,0.41666666666666669,"408","0","Except. 12,19,26jan; 02,09,16feb; 02,09mar",3.4722223877906799E-2,"ATR"]
["HUAHINE - RAIATEA","HUH","RFP","HUHRFP","Wednesday / Mercredi",0.35416669145478141,0.36805558696640861,"384","0",null,1.3888888992369175E-2,"ATR"]
["HUAHINE - TAHITI","HUH","PPT","HUHPPT","Wednesday / Mercredi",0.35416669145478141,0.41319448247803581,"384","1",null,5.9027776122093201E-2,"ATR"]
["TUBUAI - RAIVAVAE","TUB","RVV","TUBRVV","Wednesday / Mercredi",0.36111113921059501,0.38888893023384941,"916","0",null,2.777777798473835E-2,"ATR"]
["TUBUAI - TAHITI","TUB","PPT","TUBPPT","Wednesday / Mercredi",0.36111113921059501,0.47916669145478141,"916","1",null,0.1180555522441864,"ATR"]
["BORA BORA - RAIATEA","BOB","RFP","BOBRFP","Wednesday / Mercredi",0.3715278257454766,0.38541669145478141,"490","0",null,1.3888888992369175E-2,"ATR"]
["BORA BORA - HUAHINE","BOB","HUH","BOBHUH","Wednesday / Mercredi",0.3715278257454766,0.41319448247803581,"490","1",null,4.1666667908430099E-2,"ATR"]
["RURUTU - TAHITI","RUR","PPT","RURPPT","Wednesday / Mercredi",0.3715278257454766,0.4340278257454766,"939","0","15,22,29dec; 05jan; 06,13apr",6.25E-2,"ATR"]
["BORA BORA - TAHITI","BOB","PPT","BOBPPT","Wednesday / Mercredi",0.3715278257454766,0.45486113921059501,"490","2",null,8.3333335816860199E-2,"ATR"]
["RAIATEA - TAHITI","RFP","PPT","RFPPPT","Wednesday / Mercredi",0.38194448247803581,0.41319448247803581,"384","0",null,3.125E-2,"ATR"]
["RAIATEA - HUAHINE","RFP","HUH","RFPHUH","Wednesday / Mercredi",0.39930558696640861,0.41319448247803581,"490","0",null,1.3888888992369175E-2,"ATR"]
["RAIATEA - TAHITI","RFP","PPT","RFPPPT","Wednesday / Mercredi",0.39930558696640861,0.45486113921059501,"490","1",null,5.55555559694767E-2,"ATR"]
["RAIVAVAE - TAHITI","RVV","PPT","RVVPPT","Wednesday / Mercredi",0.4027778257454766,0.47916669145478141,"916","0",null,7.63888880610466E-2,"ATR"]
["TAHITI - MOOREA","PPT","MOZ","PPTMOZ","Wednesday / Mercredi",0.4375,0.44791666666666669,"264","0",null,1.0416666977107525E-2,"ATR"]
["TAHITI - BORA BORA","PPT","BOB","PPTBOB","Wednesday / Mercredi",0.4375,0.49652777777777773,"264","1",null,5.9027776122093201E-2,"ATR"]
["HUAHINE - TAHITI","HUH","PPT","HUHPPT","Wednesday / Mercredi",0.427083377989663,0.45486113921059501,"490","0",null,2.777777798473835E-2,"ATR"]
["NUKU HIVA - HIVA OA (ATUONA)","NHV","AUQ","NHVAUQ","Wednesday / Mercredi",0.427083377989663,0.45486113921059501,"0832","0","15,22dec; 05jan; 23feb; 06,13apr",2.777777798473835E-2,"ATR"]
[{"$f":" CONCATENATE(VLOOKUP(B268,esc,2,0),\" - \",VLOOKUP(C268,esc,2,0))","v":"NUKU HIVA - TAHITI"},"NHV","PPT",{"$f":"CONCATENATE(B268,C268)","v":"NHVPPT"},"Wednesday / Mercredi",0.427083377989663,0.59375003472222221,"0832","1","15,22dec; 05jan; 23feb; 06,13apr",0.1875,"ATR"]
["MOOREA - BORA BORA","MOZ","BOB","MOZBOB","Wednesday / Mercredi",0.46180555555555558,0.49652777777777773,"264","0",null,3.4722223877906799E-2,"ATR"]
["HIVA OA (ATUONA) - NUKU HIVA","AUQ","NHV","AUQNHV","Wednesday / Mercredi",0.4340278257454766,0.46180558696640861,"853","0",null,2.777777798473835E-2,"ATR"]
["TAHITI - RAIATEA","PPT","RFP","PPTRFP","Wednesday / Mercredi",0.44791666666666669,0.47916666666666669,"435","0",null,3.125E-2,"ATR"]
["TAHITI - BORA BORA","PPT","BOB","PPTBOB","Wednesday / Mercredi",0.44791666666666669,0.50694444444444442,"435","1",null,6.25E-2,"ATR"]
["HIVA OA (ATUONA) - TAHITI","AUQ","PPT","AUQPPT","Wednesday / Mercredi",0.4340278257454766,0.60763893023384941,"853","1",null,0.1944444477558136,"ATR"]
["TAHITI - BORA BORA","PPT","BOB","PPTBOB","Wednesday / Mercredi",0.47916666666666669,0.51388888888888895,"452","0",null,3.4722223877906799E-2,"ATR"]
["HIVA OA (ATUONA) - TAHITI","AUQ","PPT","AUQPPT","Wednesday / Mercredi",0.47569448247803581,0.59375003472222221,"0832","0","15,22dec; 05jan; 23feb; 06,13apr",0.1388888955116272,"ATR"]
["BORA BORA - TAHITI","BOB","PPT","BOBPPT","Wednesday / Mercredi",0.51041666666666663,0.54513888888888895,"264","0",null,3.4722223877906799E-2,"ATR"]
["RAIATEA - BORA BORA","RFP","BOB","RFPBOB","Wednesday / Mercredi",0.48263893023384941,0.50694444444444442,"435","0",null,1.3888888992369175E-2,"ATR"]
["RAIATEA - TAHITI","RFP","PPT","RFPPPT","Wednesday / Mercredi",0.48263893023384941,0.5625,"435","1",null,6.5972223877906799E-2,"ATR"]
["TAHITI - TIKEHAU","PPT","TIH","PPTTIH","Wednesday / Mercredi",0.48958333333333331,0.52777777777777779,"530","0",null,3.81944440305233E-2,"ATR"]
["TAHITI - RANGIROA","PPT","RGI","PPTRGI","Wednesday / Mercredi",0.48958333333333331,0.55555555555555558,"530","1",null,6.5972223877906799E-2,"ATR"]
["NUKU HIVA - TAHITI","NHV","PPT","NHVPPT","Wednesday / Mercredi",0.49305558696640861,0.60763893023384941,"853","0",null,0.1354166716337204,"ATR"]
["TAHITI - BORA BORA","PPT","BOB","PPTBOB","Wednesday / Mercredi",0.34375,0.37847222222222227,"467","0",null,3.4722223877906799E-2,"ATR"]
["BORA BORA - TAHITI","BOB","PPT","BOBPPT","Wednesday / Mercredi",0.52777777777777779,0.5625,"435","0",null,3.4722223877906799E-2,"ATR"]
["BORA BORA - RANGIROA","BOB","RGI","BOBRGI","Wednesday / Mercredi",0.53819444444444442,0.59027777777777779,"546","0",null,5.2083332091569901E-2,"ATR"]
["BORA BORA - TIKEHAU","BOB","TIH","BOBTIH","Wednesday / Mercredi",0.53819444444444442,0.625,"546","1",null,8.6805552244186401E-2,"ATR"]
["BORA BORA - FAKARAVA","BOB","FAV","BOBFAV","Wednesday / Mercredi",0.53472224369896781,0.649305616768731,"0546/0557","1#",null,0.1145833358168602,"ATR/ATR"]
["TIKEHAU - RANGIROA","TIH","RGI","TIHRGI","Wednesday / Mercredi",0.54166666666666663,0.55555555555555558,"530","0",null,1.3888888992369175E-2,"ATR"]
["TIKEHAU - TAHITI","TIH","PPT","TIHPPT","Wednesday / Mercredi",0.54166666666666663,0.61805555555555558,"530","1",null,7.63888880610466E-2,"ATR"]
["TIKEHAU - FAKARAVA","TIH","FAV","TIHFAV","Wednesday / Mercredi",0.53819445267571342,0.649305616768731,"0530/0557","1#",null,0.1111111119389534,"ATR/ATR"]
["TAHITI - RURUTU","PPT","RUR","PPTRUR","Wednesday / Mercredi",0.5416667212571038,0.6041667212571038,"925","0",null,6.25E-2,"ATR"]
["TAHITI - RIMATARA","PPT","RMT","PPTRMT","Wednesday / Mercredi",0.5416667212571038,0.649305616768731,"925","1",null,0.1076388880610466,"ATR"]
["BORA BORA - TAHITI","BOB","PPT","BOBPPT","Wednesday / Mercredi",0.3923611111111111,0.4236111111111111,"467","0",null,3.125E-2,"ATR"]
["TAHITI - RANGIROA","PPT","RGI","PPTRGI","Wednesday / Mercredi",0.57638888888888895,0.61805555555555558,"557","0",null,4.1666667908430099E-2,"ATR"]
["TAHITI - FAKARAVA","PPT","FAV","PPTFAV","Wednesday / Mercredi",0.57638888888888895,0.67013888888888884,"557","1",null,9.7222223877906799E-2,"ATR"]
["RANGIROA - TAHITI","RGI","PPT","RGIPPT","Wednesday / Mercredi",0.57638888888888895,0.61805555555555558,"530","0",null,4.1666667908430099E-2,"ATR"]
["TAHITI - RAIATEA","PPT","RFP","PPTRFP","Wednesday / Mercredi",0.59722224369896781,0.62847224369896781,"411","0",null,3.125E-2,"ATR"]
["TAHITI - BORA BORA","PPT","BOB","PPTBOB","Wednesday / Mercredi",0.59722224369896781,0.65625003472222221,"411","1",null,5.9027776122093201E-2,"ATR"]
["RANGIROA - TIKEHAU","RGI","TIH","RGITIH","Wednesday / Mercredi",0.61111111111111105,0.625,"546","0",null,1.3888888992369175E-2,"ATR"]
["RANGIROA - TAHITI","RGI","PPT","RGIPPT","Wednesday / Mercredi",0.61111111111111105,0.67708333333333337,"546","1",null,6.5972223877906799E-2,"ATR"]
["TAHITI - BORA BORA","PPT","BOB","PPTBOB","Wednesday / Mercredi",0.61458334818734062,0.649305616768731,"0488","0","15,22,29dec; 05jan; 06,13apr",3.4722223877906799E-2,"ATR"]
["TAHITI - RAIATEA","PPT","RFP","PPTRFP","Wednesday / Mercredi",0.61458334818734062,0.67708334818734062,"0488","1","15,22,29dec; 05jan; 06,13apr",6.25E-2,"ATR"]
["RANGIROA - FAKARAVA","RGI","FAV","RGIFAV","Wednesday / Mercredi",0.63888888888888895,0.67013888888888884,"557","0",null,3.125E-2,"ATR"]
["RANGIROA - TAHITI","RGI","PPT","RGIPPT","Wednesday / Mercredi",0.63888888888888895,0.73611111111111116,"557","1",null,9.7222223877906799E-2,"ATR"]
["RURUTU - RIMATARA","RUR","RMT","RURRMT","Wednesday / Mercredi",0.62500003472222221,0.649305616768731,"925","0",null,2.43055559694767E-2,"ATR"]
["RURUTU - TAHITI","RUR","PPT","RURPPT","Wednesday / Mercredi",0.62500003472222221,0.7291667212571038,"925","1",null,0.1041666641831398,"ATR"]
["TIKEHAU - TAHITI","TIH","PPT","TIHPPT","Wednesday / Mercredi",0.63888888888888895,0.67708333333333337,"546","0",null,3.81944440305233E-2,"ATR"]
["RAIATEA - BORA BORA","RFP","BOB","RFPBOB","Wednesday / Mercredi",0.64236113921059501,0.65625003472222221,"411","0",null,1.3888888992369175E-2,"ATR"]
["RAIATEA - TAHITI","RFP","PPT","RFPPPT","Wednesday / Mercredi",0.64236113921059501,0.711805616768731,"411","1",null,6.9444447755813599E-2,"ATR"]
["TAHITI - HUAHINE","PPT","HUH","PPTHUH","Wednesday / Mercredi",0.65277777777777779,0.68055555555555547,"396","0",null,2.777777798473835E-2,"ATR"]
["TAHITI - RAIATEA","PPT","RFP","PPTRFP","Wednesday / Mercredi",0.65277777777777779,0.70833333333333337,"396","1",null,5.55555559694767E-2,"ATR"]
["BORA BORA - RAIATEA","BOB","RFP","BOBRFP","Wednesday / Mercredi",0.66319445267571342,0.67708334818734062,"0488","0","15,22,29dec; 05jan; 06,13apr",1.3888888992369175E-2,"ATR"]
["FAKARAVA - TAHITI","FAV","PPT","FAVPPT","Wednesday / Mercredi",0.68402777777777779,0.73611111111111116,"557","0",null,5.2083332091569901E-2,"ATR"]
["BORA BORA - TAHITI","BOB","PPT","BOBPPT","Wednesday / Mercredi",0.66319445267571342,0.72222224369896781,"0488","1","15,22,29dec; 05jan; 06,13apr",5.9027776122093201E-2,"ATR"]
["RIMATARA - TAHITI","RMT","PPT","RMTPPT","Wednesday / Mercredi",0.66319445267571342,0.7291667212571038,"925","0",null,6.5972223877906799E-2,"ATR"]
["BORA BORA - TAHITI","BOB","PPT","BOBPPT","Wednesday / Mercredi",0.67708334818734062,0.711805616768731,"411","0",null,3.4722223877906799E-2,"ATR"]
["HUAHINE - RAIATEA","HUH","RFP","HUHRFP","Wednesday / Mercredi",0.69444444444444453,0.70833333333333337,"396","0",null,1.3888888992369175E-2,"ATR"]
["RAIATEA - TAHITI","RFP","PPT","RFPPPT","Wednesday / Mercredi",0.69097224369896781,0.72222224369896781,"0488","0","15,22,29dec; 05jan; 06,13apr",3.125E-2,"ATR"]
["HUAHINE - TAHITI","HUH","PPT","HUHPPT","Wednesday / Mercredi",0.69444444444444453,0.75347222222222221,"396","1",null,5.9027776122093201E-2,"ATR"]
["TAHITI - RAIATEA","PPT","RFP","PPTRFP","Wednesday / Mercredi",0.69444445267571342,0.72569445267571342,"309","0",null,3.125E-2,"ATR"]
["TAHITI - BORA BORA","PPT","BOB","PPTBOB","Wednesday / Mercredi",0.69444445267571342,0.75347224369896781,"309","1",null,5.9027776122093201E-2,"ATR"]
["RAIATEA - TAHITI","RFP","PPT","RFPPPT","Wednesday / Mercredi",0.72222222222222221,0.75347222222222221,"396","0",null,3.125E-2,"ATR"]
["TAHITI - RAIATEA","PPT","RFP","PPTRFP","Wednesday / Mercredi",0.73611113921059501,0.76736113921059501,"378","0","15,22dec; 05jan; 06,13apr",3.125E-2,"ATR"]
["TAHITI - HUAHINE","PPT","HUH","PPTHUH","Wednesday / Mercredi",0.73611113921059501,0.79513893023384941,"378","1","15,22dec; 05jan; 06,13apr",5.9027776122093201E-2,"ATR"]
["RAIATEA - BORA BORA","RFP","BOB","RFPBOB","Wednesday / Mercredi",0.73958334818734062,0.75347224369896781,"309","0",null,1.3888888992369175E-2,"ATR"]
["RAIATEA - TAHITI","RFP","PPT","RFPPPT","Wednesday / Mercredi",0.73958334818734062,0.80208334818734062,"309","1",null,6.25E-2,"ATR"]
["BORA BORA - TAHITI","BOB","PPT","BOBPPT","Wednesday / Mercredi",0.76736113921059501,0.80208334818734062,"309","0",null,3.4722223877906799E-2,"ATR"]
["RAIATEA - HUAHINE","RFP","HUH","RFPHUH","Wednesday / Mercredi",0.78125003472222221,0.79513893023384941,"378","0","15,22dec; 05jan; 06,13apr",1.3888888992369175E-2,"ATR"]
["RAIATEA - TAHITI","RFP","PPT","RFPPPT","Wednesday / Mercredi",0.78125003472222221,0.836805616768731,"378","1","15,22dec; 05jan; 06,13apr",5.55555559694767E-2,"ATR"]
["HUAHINE - TAHITI","HUH","PPT","HUHPPT","Wednesday / Mercredi",0.8090278257454766,0.836805616768731,"378","0","15,22dec; 05jan; 06,13apr",2.777777798473835E-2,"ATR"]
["TAHITI - HIVA OA (ATUONA)","PPT","AUQ","PPTAUQ","Thursday / Jeudi",0.25000003472222221,0.40972224369896781,"802","0",null,0.1388888955116272,"ATR"]
["TAHITI - NUKU HIVA","PPT","NHV","PPTNHV","Thursday / Jeudi",0.25000003472222221,0.458333377989663,"802","1",null,0.1875,"ATR"]
[{"$f":" CONCATENATE(VLOOKUP(B332,esc,2,0),\" - \",VLOOKUP(C332,esc,2,0))","v":"TAHITI - MAKEMO"},"PPT","MKP",{"$f":"CONCATENATE(B332,C332)","v":"PPTMKP"},"Thursday / Jeudi",0.270833377989663,0.33680558696640861,"964","0","16,23,30dec; 06jan; 07,14apr",6.5972223877906799E-2,"ATR"]
["TAHITI - HAO","PPT","HOI","PPTHOI","Thursday / Jeudi",0.270833377989663,0.427083377989663,"0962","2","Except. 16,23,30dec; 06jan; 07,14apr",0.15625,"ATR"]
["TAHITI - BORA BORA","PPT","BOB","PPTBOB","Thursday / Jeudi",0.28125003472222221,0.31597224369896781,"472","0",null,3.4722223877906799E-2,"ATR"]
["TAHITI - HUAHINE","PPT","HUH","PPTHUH","Thursday / Jeudi",0.28125003472222221,0.34722224369896781,"472","1",null,6.5972223877906799E-2,"ATR"]
["TAHITI - MAKEMO","PPT","MKP","PPTMKP","Thursday / Jeudi",0.29166669145478141,0.35763893023384941,"943","0","Except. 16,23,30dec; 06jan; 07,14apr",6.5972223877906799E-2,"ATR"]
["TAHITI - HAO","PPT","HOI","PPTHOI","Thursday / Jeudi",0.29166669145478141,0.4027778257454766,"942","1","16,23,30dec; 06jan; 07,14apr",0.1111111119389534,"ATR"]
["TAHITI - ANAA","PPT","AAA","PPTAAA","Thursday / Jeudi",0.29166669145478141,0.40625003472222221,"943","1","Except. 16,23,30dec; 06jan; 07,14apr",0.1145833358168602,"ATR"]
["TAHITI - BORA BORA","PPT","BOB","PPTBOB","Thursday / Jeudi",0.30555558696640861,0.3402778257454766,"487","0",null,3.4722223877906799E-2,"ATR"]
["TAHITI - RAIATEA","PPT","RFP","PPTRFP","Thursday / Jeudi",0.30555558696640861,0.36805558696640861,"487","1",null,6.25E-2,"ATR"]
["TAHITI - ANAA","PPT","AAA","PPTAAA","Thursday / Jeudi",0.33333333333333331,0.38194444444444442,"561","0","16,23,30dec; 06jan; 07,14apr",4.86111119389534E-2,"ATR"]
["BORA BORA - HUAHINE","BOB","HUH","BOBHUH","Thursday / Jeudi",0.32986113921059501,0.34722224369896781,"472","0",null,1.73611119389534E-2,"ATR"]
["BORA BORA - TAHITI","BOB","PPT","BOBPPT","Thursday / Jeudi",0.32986113921059501,0.38888893023384941,"472","1",null,5.9027776122093201E-2,"ATR"]
["BORA BORA - RANGIROA","BOB","RGI","BOBRGI","Thursday / Jeudi",0.32986113921059501,0.46180558696640861,"0472/0506","2",null,0.1319444477558136,"ATR"]
["TAHITI - HUAHINE","PPT","HUH","PPTHUH","Thursday / Jeudi",0.31944444444444448,0.34722222222222227,"353","0",null,2.777777798473835E-2,"ATR"]
["TAHITI - RAIATEA","PPT","RFP","PPTRFP","Thursday / Jeudi",0.31944444444444448,0.375,"353","1",null,5.55555559694767E-2,"ATR"]
["BORA BORA - RAIATEA","BOB","RFP","BOBRFP","Thursday / Jeudi",0.35416669145478141,0.36805558696640861,"487","0",null,1.3888888992369175E-2,"ATR"]
["BORA BORA - TAHITI","BOB","PPT","BOBPPT","Thursday / Jeudi",0.35416669145478141,0.41319448247803581,"487","1",null,5.9027776122093201E-2,"ATR"]
["TAHITI - NUKU HIVA","PPT","NHV","PPTNHV","Thursday / Jeudi",0.35416669145478141,0.5104167212571038,"834","0","16,23,30dec; 07apr",0.1354166716337204,"ATR"]
["TAHITI - HIVA OA (ATUONA)","PPT","AUQ","PPTAUQ","Thursday / Jeudi",0.35416669145478141,0.56944445267571342,"834","1","16,23,30dec; 07apr",0.1944444477558136,"ATR"]
["MAKEMO - TAHITI","MKP","PPT","MKPPPT","Thursday / Jeudi",0.35763893023384941,0.47222224369896781,"964","1","16,23,30dec; 06jan; 07,14apr",0.1145833358168602,"ATR"]
["HUAHINE - TAHITI","HUH","PPT","HUHPPT","Thursday / Jeudi",0.36111113921059501,0.38888893023384941,"472","0",null,2.777777798473835E-2,"ATR"]
["HUAHINE - RAIATEA","HUH","RFP","HUHRFP","Thursday / Jeudi",0.3611111111111111,0.375,"353","0",null,1.3888888992369175E-2,"ATR"]
["HUAHINE - TAHITI","HUH","PPT","HUHPPT","Thursday / Jeudi",0.3611111111111111,0.4236111111111111,"353","1",null,5.9027776122093201E-2,"ATR"]
["MAKEMO - TAHITI","MKP","PPT","MKPPPT","Thursday / Jeudi",0.37847224369896781,0.50347224369896781,"943","2","Except. 16,23,30dec; 06jan; 07,14apr",0.125,"ATR"]
["RAIATEA - TAHITI","RFP","PPT","RFPPPT","Thursday / Jeudi",0.38194448247803581,0.41319448247803581,"487","0",null,3.125E-2,"ATR"]
["ANAA - TAHITI","AAA","PPT","AAAPPT","Thursday / Jeudi",0.39583333333333331,0.47569444444444442,"561","1","16,23,30dec; 06jan; 07,14apr",7.98611119389534E-2,"ATR"]
["RAIATEA - RANGIROA","RFP","RGI","RFPRGI","Thursday / Jeudi",0.38194448247803581,0.46180558696640861,"0487/0506","1#",null,7.98611119389534E-2,"ATR/ATR"]
["RAIATEA - TAHITI","RFP","PPT","RFPPPT","Thursday / Jeudi",0.3923611111111111,0.4236111111111111,"353","0",null,3.125E-2,"ATR"]
["TAHITI - RANGIROA","PPT","RGI","PPTRGI","Thursday / Jeudi",0.43055555555555558,0.47222222222222227,"506","0",null,4.1666667908430099E-2,"ATR"]
["ANAA - TAHITI","AAA","PPT","AAAPPT","Thursday / Jeudi",0.42013893023384941,0.50347224369896781,"943","1","Except. 16,23,30dec; 06jan; 07,14apr",8.3333335816860199E-2,"ATR"]
["TAHITI - MATAIVA","PPT","MVT","PPTMVT","Thursday / Jeudi",0.43055555555555558,0.51388888888888895,"506","1",null,8.3333335816860199E-2,"ATR"]
["HAO - TAHITI","HOI","PPT","HOIPPT","Thursday / Jeudi",0.42361113921059501,0.51388893023384941,"942","0","16,23,30dec; 06jan; 07,14apr",9.0277776122093201E-2,"ATR"]
["HIVA OA (ATUONA) - NUKU HIVA","AUQ","NHV","AUQNHV","Thursday / Jeudi",0.43055558696640861,0.458333377989663,"802","0",null,2.777777798473835E-2,"ATR"]
["HIVA OA (ATUONA) - TAHITI","AUQ","PPT","AUQPPT","Thursday / Jeudi",0.43055558696640861,0.6041667212571038,"802","1",null,0.1944444477558136,"ATR"]
["TAHITI - BORA BORA","PPT","BOB","PPTBOB","Thursday / Jeudi",0.44097222222222227,0.47569444444444442,"410","0",null,3.4722223877906799E-2,"ATR"]
["HAO - TAHITI","HOI","PPT","HOIPPT","Thursday / Jeudi",0.44791669145478141,0.53819445267571342,"962","0","Except. 16,23,30dec; 06jan; 07,14apr",9.0277776122093201E-2,"ATR"]
["RANGIROA - MATAIVA","RGI","MVT","RGIMVT","Thursday / Jeudi",0.49305555555555558,0.51388888888888895,"506","0",null,2.083333395421505E-2,"ATR"]
["BORA BORA - TAHITI","BOB","PPT","BOBPPT","Thursday / Jeudi",0.48958333333333331,0.52430555555555558,"410","0",null,3.4722223877906799E-2,"ATR"]
["RANGIROA - TAHITI","RGI","PPT","RGIPPT","Thursday / Jeudi",0.49305555555555558,0.56597222222222221,"506","1",null,7.2916664183139801E-2,"ATR"]
["NUKU HIVA - TAHITI","NHV","PPT","NHVPPT","Thursday / Jeudi",0.489583377989663,0.6041667212571038,"802","0",null,0.1354166716337204,"ATR"]
["TAHITI - MOOREA","PPT","MOZ","PPTMOZ","Thursday / Jeudi",0.4965278257454766,0.50694445267571342,"241","0",null,1.0416666977107525E-2,"ATR"]
["TAHITI - HUAHINE","PPT","HUH","PPTHUH","Thursday / Jeudi",0.4965278257454766,0.54513893023384941,"241","1",null,4.86111119389534E-2,"ATR"]
["TAHITI - BORA BORA","PPT","BOB","PPTBOB","Thursday / Jeudi",0.4965278257454766,0.57638893023384941,"241","2",null,7.98611119389534E-2,"ATR"]
["MATAIVA - TAHITI","MVT","PPT","MVTPPT","Thursday / Jeudi",0.52777777777777779,0.56597222222222221,"506","0",null,3.81944440305233E-2,"ATR"]
["MOOREA - HUAHINE","MOZ","HUH","MOZHUH","Thursday / Jeudi",0.52083334818734062,0.54513893023384941,"241","0",null,2.43055559694767E-2,"ATR"]
["MOOREA - BORA BORA","MOZ","BOB","MOZBOB","Thursday / Jeudi",0.52083334818734062,0.57638893023384941,"241","1",null,5.55555559694767E-2,"ATR"]
["BORA BORA - RANGIROA","BOB","RGI","BOBRGI","Thursday / Jeudi",0.49652777777777773,0.54861111111111105,"555","0","07,14apr",5.2083332091569901E-2,"ATR"]
["BORA BORA - TIKEHAU","BOB","TIH","BOBTIH","Thursday / Jeudi",0.49652777777777773,0.58680555555555558,"555","1","07,14apr",9.0277776122093201E-2,"ATR"]
["TAHITI - TIKEHAU","PPT","TIH","PPTTIH","Thursday / Jeudi",0.53125003472222221,0.56944445267571342,"514","0",null,3.81944440305233E-2,"ATR"]
["TAHITI - RANGIROA","PPT","RGI","PPTRGI","Thursday / Jeudi",0.53125003472222221,0.59722224369896781,"514","1",null,6.5972223877906799E-2,"ATR"]
["NUKU HIVA - HIVA OA (ATUONA)","NHV","AUQ","NHVAUQ","Thursday / Jeudi",0.5416667212571038,0.56944445267571342,"834","0","16,23,30dec; 07apr",2.777777798473835E-2,"ATR"]
["NUKU HIVA - TAHITI","NHV","PPT","NHVPPT","Thursday / Jeudi",0.5416667212571038,0.70833334818734062,"834","1","16,23,30dec; 07apr",0.1875,"ATR"]
["TAHITI - RAIATEA","PPT","RFP","PPTRFP","Thursday / Jeudi",0.54861113921059501,0.57986113921059501,"366","0",null,3.125E-2,"ATR"]
["TAHITI - HUAHINE","PPT","HUH","PPTHUH","Thursday / Jeudi",0.54861113921059501,0.60763893023384941,"366","1",null,5.9027776122093201E-2,"ATR"]
["HUAHINE - BORA BORA","HUH","BOB","HUHBOB","Thursday / Jeudi",0.5590278257454766,0.57638893023384941,"241","0",null,1.73611119389534E-2,"ATR"]
["HUAHINE - TAHITI","HUH","PPT","HUHPPT","Thursday / Jeudi",0.5590278257454766,0.63194445267571342,"0241","1",null,7.2916664183139801E-2,"ATR"]
["TAHITI - TAKAPOTO","PPT","TKP","PPTTKP","Thursday / Jeudi",0.56250003472222221,0.618055616768731,"573","0","16,23,30dec; 06jan; 07,14apr",5.55555559694767E-2,"ATR"]
["TAHITI - TAKAROA","PPT","TKX","PPTTKX","Thursday / Jeudi",0.56250003472222221,0.64236113921059501,"573","1","16,23,30dec; 06jan; 07,14apr",7.98611119389534E-2,"ATR"]
["TAHITI - RAIATEA","PPT","RFP","PPTRFP","Thursday / Jeudi",0.58680555555555558,0.61805555555555558,"448","0","16,23,30dec; 06jan; 07,14apr",3.125E-2,"ATR"]
["TAHITI - BORA BORA","PPT","BOB","PPTBOB","Thursday / Jeudi",0.58680555555555558,0.64583333333333337,"448","1","16,23,30dec; 06jan; 07,14apr",5.9027776122093201E-2,"ATR"]
["TIKEHAU - RANGIROA","TIH","RGI","TIHRGI","Thursday / Jeudi",0.58333334818734062,0.59722224369896781,"514","0",null,1.3888888992369175E-2,"ATR"]
["TIKEHAU - TAHITI","TIH","PPT","TIHPPT","Thursday / Jeudi",0.58333334818734062,0.66319445267571342,"514","1",null,7.98611119389534E-2,"ATR"]
["HIVA OA (ATUONA) - TAHITI","AUQ","PPT","AUQPPT","Thursday / Jeudi",0.5902778257454766,0.70833334818734062,"834","0","16,23,30dec; 07apr",0.1388888955116272,"ATR"]
["RAIATEA - HUAHINE","RFP","HUH","RFPHUH","Thursday / Jeudi",0.59375003472222221,0.60763893023384941,"366","0",null,1.3888888992369175E-2,"ATR"]
[{"$f":" CONCATENATE(VLOOKUP(B396,esc,2,0),\" - \",VLOOKUP(C396,esc,2,0))","v":"RAIATEA - TAHITI"},"RFP","PPT",{"$f":"CONCATENATE(B396,C396)","v":"RFPPPT"},"Thursday / Jeudi",0.59375003472222221,0.649305616768731,"366","1",null,5.55555559694767E-2,"ATR"]
["BORA BORA - TAHITI","BOB","PPT","BOBPPT","Thursday / Jeudi",0.59722224369896781,0.63194445267571342,"241","0",null,3.4722223877906799E-2,"ATR"]
["RANGIROA - TIKEHAU","RGI","TIH","RGITIH","Thursday / Jeudi",0.57291666666666663,0.58680555555555558,"555","0","07,14apr",1.3888888992369175E-2,"ATR"]
["RANGIROA - TAHITI","RGI","PPT","RGIPPT","Thursday / Jeudi",0.57291666666666663,0.63888888888888895,"555","1","07,14apr",6.5972223877906799E-2,"ATR"]
["RAIATEA - BORA BORA","RFP","BOB","RFPBOB","Thursday / Jeudi",0.63194444444444442,0.64583333333333337,"448","0","16,23,30dec; 06jan; 07,14apr",1.3888888992369175E-2,"ATR"]
["HUAHINE - TAHITI","HUH","PPT","HUHPPT","Thursday / Jeudi",0.6215278257454766,0.649305616768731,"366","0",null,2.777777798473835E-2,"ATR"]
["RANGIROA - TAHITI","RGI","PPT","RGIPPT","Thursday / Jeudi",0.6215278257454766,0.66319445267571342,"514","0",null,4.1666667908430099E-2,"ATR"]
["RAIATEA - TAHITI","RFP","PPT","RFPPPT","Thursday / Jeudi",0.63194444444444442,0.69444444444444453,"448","1","16,23,30dec; 06jan; 07,14apr",6.25E-2,"ATR"]
["TIKEHAU - TAHITI","TIH","PPT","TIHPPT","Thursday / Jeudi",0.60069444444444442,0.63888888888888895,"555","0","07,14apr",3.81944440305233E-2,"ATR"]
["TAKAPOTO - TAHITI","TKP","PPT","TKPPPT","Thursday / Jeudi",0.63194445267571342,0.72222224369896781,"573","1","16,23,30dec; 06jan; 07,14apr",9.0277776122093201E-2,"ATR"]
["BORA BORA - TAHITI","BOB","PPT","BOBPPT","Thursday / Jeudi",0.65972222222222221,0.69444444444444453,"448","0","16,23,30dec; 06jan; 07,14apr",3.4722223877906799E-2,"ATR"]
["HAO - TAHITI","HOI","PPT","HOIPPT","Thursday / Jeudi",0.6527778257454766,0.743055616768731,"981","0","Except. 09,16,23,30dec; 06,27jan; 24feb; 07,14apr",9.0277776122093201E-2,"ATR"]
["HAO - TAHITI","HOI","PPT","HOIPPT","Thursday / Jeudi",0.6527778257454766,0.7465278257454766,"0981","0","16,23dec; 06jan; 07,14apr",9.375E-2,"ATR"]
["TAHITI - BORA BORA","PPT","BOB","PPTBOB","Thursday / Jeudi",0.66319445267571342,0.6979167212571038,"0496","0",null,3.4722223877906799E-2,"ATR"]
["TAKAROA - TAHITI","TKX","PPT","TKXPPT","Thursday / Jeudi",0.66319445267571342,0.72222224369896781,"573","0","16,23,30dec; 06jan; 07,14apr",5.9027776122093201E-2,"ATR"]
["TAHITI - BORA BORA","PPT","BOB","PPTBOB","Thursday / Jeudi",0.67361113921059501,0.70833334818734062,"318","0","Except. 18,25nov; 02,09dec; 13,20,27jan; 03,10,17feb",3.4722223877906799E-2,"ATR"]
["TAHITI - RAIATEA","PPT","RFP","PPTRFP","Thursday / Jeudi",0.67361113921059501,0.73958334818734062,"318","1","Except. 18,25nov; 02,09dec; 13,20,27jan; 03,10,17feb",6.5972223877906799E-2,"ATR"]
["TAHITI - RAIATEA","PPT","RFP","PPTRFP","Thursday / Jeudi",0.6840278257454766,0.7152778257454766,"465","0",null,3.125E-2,"ATR"]
["TAHITI - BORA BORA","PPT","BOB","PPTBOB","Thursday / Jeudi",0.6840278257454766,0.743055616768731,"465","1",null,5.9027776122093201E-2,"ATR"]
["TAHITI - HUAHINE","PPT","HUH","PPTHUH","Thursday / Jeudi",0.69791666666666663,0.72569444444444453,"404","0",null,2.777777798473835E-2,"ATR"]
["TAHITI - BORA BORA","PPT","BOB","PPTBOB","Thursday / Jeudi",0.69791666666666663,0.75694444444444453,"404","1",null,5.9027776122093201E-2,"ATR"]
["BORA BORA - TAHITI","BOB","PPT","BOBPPT","Thursday / Jeudi",0.711805616768731,0.7465278257454766,"0496","0",null,3.4722223877906799E-2,"ATR"]
["BORA BORA - RAIATEA","BOB","RFP","BOBRFP","Thursday / Jeudi",0.72569445267571342,0.73958334818734062,"318","0","Except. 18,25nov; 02,09dec; 13,20,27jan; 03,10,17feb",1.3888888992369175E-2,"ATR"]
["BORA BORA - TAHITI","BOB","PPT","BOBPPT","Thursday / Jeudi",0.72569445267571342,0.78472224369896781,"318","1","Except. 18,25nov; 02,09dec; 13,20,27jan; 03,10,17feb",5.9027776122093201E-2,"ATR"]
["RAIATEA - BORA BORA","RFP","BOB","RFPBOB","Thursday / Jeudi",0.7291667212571038,0.743055616768731,"465","0",null,1.3888888992369175E-2,"ATR"]
["TAHITI - HUAHINE","PPT","HUH","PPTHUH","Thursday / Jeudi",0.7291667212571038,0.75694445267571342,"379","0","16,23,30dec; 06jan; 07,14apr",2.777777798473835E-2,"ATR"]
["TAHITI - RAIATEA","PPT","RFP","PPTRFP","Thursday / Jeudi",0.7291667212571038,0.78472224369896781,"379","1","16,23,30dec; 06jan; 07,14apr",5.55555559694767E-2,"ATR"]
["RAIATEA - TAHITI","RFP","PPT","RFPPPT","Thursday / Jeudi",0.7291667212571038,0.7916667212571038,"465","1",null,6.25E-2,"ATR"]
["HUAHINE - BORA BORA","HUH","BOB","HUHBOB","Thursday / Jeudi",0.73958333333333337,0.75694444444444453,"404","0",null,1.73611119389534E-2,"ATR"]
["HUAHINE - TAHITI","HUH","PPT","HUHPPT","Thursday / Jeudi",0.73958333333333337,0.80208333333333337,"404","1",null,6.5972223877906799E-2,"ATR"]
["RAIATEA - TAHITI","RFP","PPT","RFPPPT","Thursday / Jeudi",0.75347224369896781,0.78472224369896781,"318","0","Except. 18,25nov; 02,09dec; 13,20,27jan; 03,10,17feb",3.125E-2,"ATR"]
["BORA BORA - TAHITI","BOB","PPT","BOBPPT","Thursday / Jeudi",0.75694445267571342,0.7916667212571038,"465","0",null,3.4722223877906799E-2,"ATR"]
["HUAHINE - RAIATEA","HUH","RFP","HUHRFP","Thursday / Jeudi",0.77083334818734062,0.78472224369896781,"379","0","16,23,30dec; 06jan; 07,14apr",1.3888888992369175E-2,"ATR"]
["HUAHINE - TAHITI","HUH","PPT","HUHPPT","Thursday / Jeudi",0.77083334818734062,0.82986113921059501,"379","1","16,23,30dec; 06jan; 07,14apr",5.9027776122093201E-2,"ATR"]
["BORA BORA - TAHITI","BOB","PPT","BOBPPT","Thursday / Jeudi",0.77083333333333337,0.80208333333333337,"404","0",null,3.4722223877906799E-2,"ATR"]
["RAIATEA - TAHITI","RFP","PPT","RFPPPT","Thursday / Jeudi",0.79861113921059501,0.82986113921059501,"379","0","16,23,30dec; 06jan; 07,14apr",3.125E-2,"ATR"]
["TAHITI - RIMATARA","PPT","RMT","PPTRMT","Friday / Vendredi",0.22916670635594261,0.302083377989663,"923","0",null,7.2916664183139801E-2,"ATR"]
["TAHITI - RURUTU","PPT","RUR","PPTRUR","Friday / Vendredi",0.22916670635594261,0.33680558696640861,"923","1",null,0.1076388880610466,"ATR"]
["TAHITI - NUKU HIVA","PPT","NHV","PPTNHV","Friday / Vendredi",0.25000003472222221,0.40625003472222221,"822","0",null,0.1354166716337204,"ATR"]
["TAHITI - HIVA OA (ATUONA)","PPT","AUQ","PPTAUQ","Friday / Vendredi",0.25000003472222221,0.4652778257454766,"822","1",null,0.1944444477558136,"ATR"]
["TAHITI - HIVA OA (ATUONA)","PPT","AUQ","PPTAUQ","Friday / Vendredi",0.270833377989663,0.43055558696640861,"855","0","10,17,24,31dec; 07jan; 18feb; 01,08,15apr",0.1388888955116272,"ATR"]
["TAHITI - NUKU HIVA","PPT","NHV","PPTNHV","Friday / Vendredi",0.270833377989663,0.47916669145478141,"855","1","10,17,24,31dec; 07jan; 18feb; 01,08,15apr",0.1875,"ATR"]
["TAHITI - MAUPITI","PPT","MAU","PPTMAU","Friday / Vendredi",0.29166669145478141,0.32986113921059501,"734","0",null,3.81944440305233E-2,"ATR"]
["TAHITI - RAIATEA","PPT","RFP","PPTRFP","Friday / Vendredi",0.29166669145478141,0.36111113921059501,"734","1",null,6.9444447755813599E-2,"ATR"]
["TAHITI - HUAHINE","PPT","HUH","PPTHUH","Friday / Vendredi",0.302083377989663,0.32986113921059501,"468","0",null,2.777777798473835E-2,"ATR"]
["TAHITI - BORA BORA","PPT","BOB","PPTBOB","Friday / Vendredi",0.302083377989663,0.364583377989663,"468","1",null,6.25E-2,"ATR"]
["TAHITI - ARUTUA","PPT","AXR","PPTAXR","Friday / Vendredi",0.31250003472222221,0.36111113921059501,"588","0","Except. 10,17,24,31dec; 07jan; 25feb; 01,08,15apr",4.86111119389534E-2,"ATR"]
["TAHITI - AHE","PPT","AHE","PPTAHE","Friday / Vendredi",0.31250003472222221,0.39236113921059501,"588","1","Except. 10,17,24,31dec; 07jan; 25feb; 01,08,15apr",7.98611119389534E-2,"ATR"]
["TAHITI - MANIHI","PPT","XMH","PPTXMH","Friday / Vendredi",0.31250003472222221,0.41319448247803581,"588","2","Except. 10,17,24,31dec; 07jan; 25feb; 01,08,15apr",0.1006944477558136,"ATR"]
["RIMATARA - RURUTU","RMT","RUR","RMTRUR","Friday / Vendredi",0.31597224369896781,0.33680558696640861,"923","0",null,2.083333395421505E-2,"ATR"]
["RIMATARA - TAHITI","RMT","PPT","RMTPPT","Friday / Vendredi",0.31597224369896781,0.42013893023384941,"923","1",null,0.1041666641831398,"ATR"]
["TAHITI - BORA BORA","PPT","BOB","PPTBOB","Friday / Vendredi",0.32291669145478141,0.35763893023384941,"420","0",null,3.4722223877906799E-2,"ATR"]
["TAHITI - RAIATEA","PPT","RFP","PPTRFP","Friday / Vendredi",0.33680558696640861,0.36805558696640861,"332","0",null,3.125E-2,"ATR"]
["TAHITI - HUAHINE","PPT","HUH","PPTHUH","Friday / Vendredi",0.33680558696640861,0.40625003472222221,"332","1",null,6.9444447755813599E-2,"ATR"]
["MAUPITI - RAIATEA","MAU","RFP","MAURFP","Friday / Vendredi",0.34375003472222221,0.36111113921059501,"734","0",null,1.73611119389534E-2,"ATR"]
["MAUPITI - TAHITI","MAU","PPT","MAUPPT","Friday / Vendredi",0.34375003472222221,0.44791669145478141,"0734/0332","2#",null,0.1041666641831398,"ATR/ATR"]
["HUAHINE - BORA BORA","HUH","BOB","HUHBOB","Friday / Vendredi",0.34722224369896781,0.364583377989663,"468","0",null,1.73611119389534E-2,"ATR"]
["HUAHINE - TAHITI","HUH","PPT","HUHPPT","Friday / Vendredi",0.34722224369896781,0.41666669145478141,"468","1",null,6.9444447755813599E-2,"ATR"]
["RURUTU - TAHITI","RUR","PPT","RURPPT","Friday / Vendredi",0.35763893023384941,0.42013893023384941,"923","0",null,6.25E-2,"ATR"]
["BORA BORA - TAHITI","BOB","PPT","BOBPPT","Friday / Vendredi",0.3715278257454766,0.4027778257454766,"420","0",null,3.125E-2,"ATR"]
["ARUTUA - TAHITI","AXR","PPT","AXRPPT","Friday / Vendredi",0.37500003472222221,0.48263893023384941,"588","2","Except. 10,17,24,31dec; 07jan; 25feb; 01,08,15apr",0.1076388880610466,"ATR"]
["RAIATEA - MAUPITI","RFP","MAU","RFPMAU","Friday / Vendredi",0.38194448247803581,0.39930558696640861,"735","0",null,1.73611119389534E-2,"ATR"]
["BORA BORA - TAHITI","BOB","PPT","BOBPPT","Friday / Vendredi",0.38194448247803581,0.41666669145478141,"468","0",null,3.4722223877906799E-2,"ATR"]
["RAIATEA - TAHITI","RFP","PPT","RFPPPT","Friday / Vendredi",0.38194448247803581,0.44791669145478141,"735","1",null,6.5972223877906799E-2,"ATR"]
[{"$f":" CONCATENATE(VLOOKUP(B460,esc,2,0),\" - \",VLOOKUP(C460,esc,2,0))","v":"BORA BORA - RANGIROA"},"BOB","RGI",{"$f":"CONCATENATE(B460,C460)","v":"BOBRGI"},"Friday / Vendredi",0.38194448247803581,0.67361113921059501,"0468/0550","1#",null,0.2916666567325592,"ATR/ATR"]
["BORA BORA - TIKEHAU","BOB","TIH","BOBTIH","Friday / Vendredi",0.38194448247803581,0.70833334818734062,"0468/0550","2#",null,0.3263888955116272,"ATR/ATR"]
["RAIATEA - HUAHINE","RFP","HUH","RFPHUH","Friday / Vendredi",0.39236113921059501,0.40625003472222221,"332","0",null,1.3888888992369175E-2,"ATR"]
["RAIATEA - TAHITI","RFP","PPT","RFPPPT","Friday / Vendredi",0.39236113921059501,0.44791669145478141,"332","1",null,5.55555559694767E-2,"ATR"]
["AHE - MANIHI","AHE","XMH","AHEXMH","Friday / Vendredi",0.40625003472222221,0.41319448247803581,"588","0","Except. 10,17,24,31dec; 07jan; 25feb; 01,08,15apr",6.9444444961845875E-3,"ATR"]
["AHE - TAHITI","AHE","PPT","AHEPPT","Friday / Vendredi",0.40625003472222221,0.48263893023384941,"588","1","Except. 10,17,24,31dec; 07jan; 25feb; 01,08,15apr",7.63888880610466E-2,"ATR"]
["MAUPITI - TAHITI","MAU","PPT","MAUPPT","Friday / Vendredi",0.41319448247803581,0.44791669145478141,"735","0",null,3.4722223877906799E-2,"ATR"]
["HUAHINE - TAHITI","HUH","PPT","HUHPPT","Friday / Vendredi",0.42013893023384941,0.44791669145478141,"332","0",null,2.777777798473835E-2,"ATR"]
["TAHITI - MOOREA","PPT","MOZ","PPTMOZ","Friday / Vendredi",0.42361113921059501,0.4340278257454766,"298","0",null,1.0416666977107525E-2,"ATR"]
["TAHITI - BORA BORA","PPT","BOB","PPTBOB","Friday / Vendredi",0.42361113921059501,0.48263893023384941,"298","1",null,5.9027776122093201E-2,"ATR"]
["MANIHI - TAHITI","XMH","PPT","XMHPPT","Friday / Vendredi",0.427083377989663,0.48263893023384941,"588","0","Except. 10,17,24,31dec; 07jan; 25feb; 01,08,15apr",5.55555559694767E-2,"ATR"]
["TAHITI - ARUTUA","PPT","AXR","PPTAXR","Friday / Vendredi",0.4340278257454766,0.47916669145478141,"519","0","Except. 12,19,26nov; 03dec; 14,21,28jan; 04,11,18feb",4.51388880610466E-2,"ATR"]
["NUKU HIVA - HIVA OA (ATUONA)","NHV","AUQ","NHVAUQ","Friday / Vendredi",0.43750003472222221,0.4652778257454766,"822","0",null,2.777777798473835E-2,"ATR"]
["NUKU HIVA - TAHITI","NHV","PPT","NHVPPT","Friday / Vendredi",0.43750003472222221,0.6041667212571038,"822","1",null,0.1875,"ATR"]
["TAHITI - BORA BORA","PPT","BOB","PPTBOB","Friday / Vendredi",0.44444448247803581,0.47916669145478141,"439","0",null,3.4722223877906799E-2,"ATR"]
["MOOREA - BORA BORA","MOZ","BOB","MOZBOB","Friday / Vendredi",0.44791669145478141,0.48263893023384941,"298","0",null,3.4722223877906799E-2,"ATR"]
["HIVA OA (ATUONA) - NUKU HIVA","AUQ","NHV","AUQNHV","Friday / Vendredi",0.45138893023384941,0.47916669145478141,"855","0","10,17,24,31dec; 07jan; 18feb; 01,08,15apr",2.777777798473835E-2,"ATR"]
["HIVA OA (ATUONA) - TAHITI","AUQ","PPT","AUQPPT","Friday / Vendredi",0.45138893023384941,0.62500003472222221,"855","1","10,17,24,31dec; 07jan; 18feb; 01,08,15apr",0.1944444477558136,"ATR"]
["TAHITI - RAIVAVAE","PPT","RVV","PPTRVV","Friday / Vendredi",0.458333377989663,0.53472224369896781,"931","0",null,7.63888880610466E-2,"ATR"]
["TAHITI - TUBUAI","PPT","TUB","PPTTUB","Friday / Vendredi",0.458333377989663,0.57638893023384941,"931","1",null,0.1180555522441864,"ATR"]
["TAHITI - BORA BORA","PPT","BOB","PPTBOB","Friday / Vendredi",0.47222224369896781,0.50694445267571342,"494","0",null,3.4722223877906799E-2,"ATR"]
["TAHITI - RAIATEA","PPT","RFP","PPTRFP","Friday / Vendredi",0.47222224369896781,0.53472224369896781,"494","1",null,6.25E-2,"ATR"]
["TAHITI - AHE","PPT","AHE","PPTAHE","Friday / Vendredi",0.48263893023384941,0.53472224369896781,"521","0","17,24,31dec; 07jan",5.2083332091569901E-2,"ATR"]
["HIVA OA (ATUONA) - TAHITI","AUQ","PPT","AUQPPT","Friday / Vendredi",0.48611113921059501,0.6041667212571038,"822","0",null,0.1388888955116272,"ATR"]
["BORA BORA - TAHITI","BOB","PPT","BOBPPT","Friday / Vendredi",0.49305558696640861,0.5277778257454766,"439","0",null,3.4722223877906799E-2,"ATR"]
["ARUTUA - TAHITI","AXR","PPT","AXRPPT","Friday / Vendredi",0.49305558696640861,0.53819445267571342,"519","0","Except. 12,19,26nov; 03dec; 14,21,28jan; 04,11,18feb",4.51388880610466E-2,"ATR"]
["TAHITI - AHE","PPT","AHE","PPTAHE","Friday / Vendredi",0.50000003472222221,0.55208334818734062,"595","0","10dec; 25feb; 01,08,15apr",5.2083332091569901E-2,"ATR"]
["TAHITI - MANIHI","PPT","XMH","PPTXMH","Friday / Vendredi",0.50000003472222221,0.5729167212571038,"595","1","10dec; 25feb; 01,08,15apr",7.2916664183139801E-2,"ATR"]
["BORA BORA - MOOREA","BOB","MOZ","BOBMOZ","Friday / Vendredi",0.50347224369896781,0.53472224369896781,"269","0",null,3.125E-2,"ATR"]
["BORA BORA - TAHITI","BOB","PPT","BOBPPT","Friday / Vendredi",0.50347224369896781,0.5590278257454766,"269","1",null,5.55555559694767E-2,"ATR"]
["NUKU HIVA - TAHITI","NHV","PPT","NHVPPT","Friday / Vendredi",0.5104167212571038,0.62500003472222221,"855","0","10,17,24,31dec; 07jan; 18feb; 01,08,15apr",0.1354166716337204,"ATR"]
["TAHITI - FAKARAVA","PPT","FAV","PPTFAV","Friday / Vendredi",0.51736113921059501,0.56597224369896781,"533","0","03,10dec",4.86111119389534E-2,"ATR"]
["TAHITI - RANGIROA","PPT","RGI","PPTRGI","Friday / Vendredi",0.51736113921059501,0.61111113921059501,"533","1","03,10dec",9.375E-2,"ATR"]
["BORA BORA - RAIATEA","BOB","RFP","BOBRFP","Friday / Vendredi",0.52083334818734062,0.53472224369896781,"494","0",null,1.3888888992369175E-2,"ATR"]
["BORA BORA - TAHITI","BOB","PPT","BOBPPT","Friday / Vendredi",0.52083334818734062,0.57986113921059501,"494","1",null,5.9027776122093201E-2,"ATR"]
["MOOREA - TAHITI","MOZ","PPT","MOZPPT","Friday / Vendredi",0.54861113921059501,0.5590278257454766,"269","0",null,1.0416666977107525E-2,"ATR"]
["RAIVAVAE - TUBUAI","RVV","TUB","RVVTUB","Friday / Vendredi",0.54861113921059501,0.57638893023384941,"931","0",null,2.777777798473835E-2,"ATR"]
["RAIATEA - TAHITI","RFP","PPT","RFPPPT","Friday / Vendredi",0.54861113921059501,0.57986113921059501,"494","0",null,3.125E-2,"ATR"]
["AHE - TAHITI","AHE","PPT","AHEPPT","Friday / Vendredi",0.54861113921059501,0.60069445267571342,"521","0","17,24,31dec; 07jan",5.2083332091569901E-2,"ATR"]
["RAIVAVAE - TAHITI","RVV","PPT","RVVPPT","Friday / Vendredi",0.54861113921059501,0.6666667212571038,"931","1",null,0.1180555522441864,"ATR"]
["TAHITI - RURUTU","PPT","RUR","PPTRUR","Friday / Vendredi",0.555555616768731,0.618055616768731,"0912","0","10,17,24,31dec; 07jan; 18,25feb; 01,08,15apr",6.25E-2,"ATR"]
["TAHITI - TUBUAI","PPT","TUB","PPTTUB","Friday / Vendredi",0.555555616768731,0.6666667212571038,"0912","1","10,17,24,31dec; 07jan; 18,25feb; 01,08,15apr",0.1111111119389534,"ATR"]
["AHE - MANIHI","AHE","XMH","AHEXMH","Friday / Vendredi",0.56597224369896781,0.5729167212571038,"595","0","10dec; 25feb; 01,08,15apr",6.9444444961845875E-3,"ATR"]
["TAHITI - MAUPITI","PPT","MAU","PPTMAU","Friday / Vendredi",0.56597224369896781,0.6041667212571038,"756","0",null,3.81944440305233E-2,"ATR"]
["AHE - TAHITI","AHE","PPT","AHEPPT","Friday / Vendredi",0.56597224369896781,0.64236113921059501,"595","1","10dec; 25feb; 01,08,15apr",7.63888880610466E-2,"ATR"]
["FAKARAVA - RANGIROA","FAV","RGI","FAVRGI","Friday / Vendredi",0.57986113921059501,0.61111113921059501,"533","0","03,10dec",3.125E-2,"ATR"]
["TAHITI - RANGIROA","PPT","RGI","PPTRGI","Friday / Vendredi",0.57986113921059501,0.6215278257454766,"562","0","12,19,26nov; 03,10dec",4.1666667908430099E-2,"ATR"]
["TAHITI - FAKARAVA","PPT","FAV","PPTFAV","Friday / Vendredi",0.57986113921059501,0.6666667212571038,"562","1","12,19,26nov; 03,10dec",8.6805552244186401E-2,"ATR"]
["FAKARAVA - TAHITI","FAV","PPT","FAVPPT","Friday / Vendredi",0.57986113921059501,0.67361113921059501,"533","1","03,10dec",9.375E-2,"ATR"]
["MANIHI - TAHITI","XMH","PPT","XMHPPT","Friday / Vendredi",0.586805616768731,0.64236113921059501,"595","0","10dec; 25feb; 01,08,15apr",5.55555559694767E-2,"ATR"]
["TUBUAI - TAHITI","TUB","PPT","TUBPPT","Friday / Vendredi",0.59722224369896781,0.6666667212571038,"931","0",null,6.9444447755813599E-2,"ATR"]
["TAHITI - RAIATEA","PPT","RFP","PPTRFP","Friday / Vendredi",0.6041667212571038,0.6354167212571038,"417","0",null,3.125E-2,"ATR"]
["TAHITI - BORA BORA","PPT","BOB","PPTBOB","Friday / Vendredi",0.6041667212571038,0.66319445267571342,"417","1",null,5.9027776122093201E-2,"ATR"]
["MAUPITI - RAIATEA","MAU","RFP","MAURFP","Friday / Vendredi",0.618055616768731,0.6354167212571038,"756","0",null,1.73611119389534E-2,"ATR"]
["TAHITI - MANIHI","PPT","XMH","PPTXMH","Friday / Vendredi",0.6215278257454766,0.67361113921059501,"597","0","17,24,31dec; 07jan",5.2083332091569901E-2,"ATR"]
["TAHITI - RANGIROA","PPT","RGI","PPTRGI","Friday / Vendredi",0.63194445267571342,0.67361113921059501,"550","0",null,4.1666667908430099E-2,"ATR"]
["RANGIROA - TAHITI","RGI","PPT","RGIPPT","Friday / Vendredi",0.63194445267571342,0.67361113921059501,"533","0","03,10dec",4.1666667908430099E-2,"ATR"]
["TAHITI - TIKEHAU","PPT","TIH","PPTTIH","Friday / Vendredi",0.63194445267571342,0.70833334818734062,"550","1",null,7.63888880610466E-2,"ATR"]
["RANGIROA - FAKARAVA","RGI","FAV","RGIFAV","Friday / Vendredi",0.6354167212571038,0.6666667212571038,"562","0","12,19,26nov; 03,10dec",3.125E-2,"ATR"]
["RANGIROA - TAHITI","RGI","PPT","RGIPPT","Friday / Vendredi",0.6354167212571038,0.73958334818734062,"562","1","12,19,26nov; 03,10dec",0.1041666641831398,"ATR"]
["RURUTU - TUBUAI","RUR","TUB","RURTUB","Friday / Vendredi",0.63888893023384941,0.6666667212571038,"0912","0","10,17,24,31dec; 07jan; 18,25feb; 01,08,15apr",2.777777798473835E-2,"ATR"]
["RURUTU - TAHITI","RUR","PPT","RURPPT","Friday / Vendredi",0.63888893023384941,0.75694445267571342,"0912","1","10,17,24,31dec; 07jan; 18,25feb; 01,08,15apr",0.1180555522441864,"ATR"]
["TAHITI - RANGIROA","PPT","RGI","PPTRGI","Friday / Vendredi",0.64583334818734062,0.68750003472222221,"0574","0","Except. 10,17,24,31dec; 07jan; 18,25feb; 01,08,15apr",4.1666667908430099E-2,"ATR"]
["RAIATEA - BORA BORA","RFP","BOB","RFPBOB","Friday / Vendredi",0.649305616768731,0.66319445267571342,"417","0",null,1.3888888992369175E-2,"ATR"]
[{"$f":" CONCATENATE(VLOOKUP(B524,esc,2,0),\" - \",VLOOKUP(C524,esc,2,0))","v":"RAIATEA - TAHITI"},"RFP","PPT",{"$f":"CONCATENATE(B524,C524)","v":"RFPPPT"},"Friday / Vendredi",0.649305616768731,0.711805616768731,"417","1",null,6.25E-2,"ATR"]
["RAIATEA - MAUPITI","RFP","MAU","RFPMAU","Friday / Vendredi",0.65625003472222221,0.67361113921059501,"757","0",null,1.73611119389534E-2,"ATR"]
["BORA BORA - TAHITI","BOB","PPT","BOBPPT","Friday / Vendredi",0.67708334818734062,0.711805616768731,"417","0",null,3.4722223877906799E-2,"ATR"]
["MAUPITI - TAHITI","MAU","PPT","MAUPPT","Friday / Vendredi",0.68750003472222221,0.72222224369896781,"757","0",null,3.4722223877906799E-2,"ATR"]
["FAKARAVA - TAHITI","FAV","PPT","FAVPPT","Friday / Vendredi",0.68750003472222221,0.73958334818734062,"562","0","12,19,26nov; 03,10dec",5.2083332091569901E-2,"ATR"]
["MANIHI - TAHITI","XMH","PPT","XMHPPT","Friday / Vendredi",0.68750003472222221,0.743055616768731,"597","0","17,24,31dec; 07jan",5.55555559694767E-2,"ATR"]
["TUBUAI - TAHITI","TUB","PPT","TUBPPT","Friday / Vendredi",0.68750003472222221,0.75694445267571342,"0912","0","10,17,24,31dec; 07jan; 18,25feb; 01,08,15apr",6.9444447755813599E-2,"ATR"]
["TAHITI - RAIATEA","PPT","RFP","PPTRFP","Friday / Vendredi",0.69097224369896781,0.72222224369896781,"442","0",null,3.125E-2,"ATR"]
["TAHITI - BORA BORA","PPT","BOB","PPTBOB","Friday / Vendredi",0.69097224369896781,0.75347224369896781,"442","1",null,6.25E-2,"ATR"]
["RANGIROA - TIKEHAU","RGI","TIH","RGITIH","Friday / Vendredi",0.69444445267571342,0.70833334818734062,"550","0",null,1.3888888992369175E-2,"ATR"]
["RANGIROA - TAHITI","RGI","PPT","RGIPPT","Friday / Vendredi",0.69444445267571342,0.7604167212571038,"550","1",null,6.5972223877906799E-2,"ATR"]
["TAHITI - BORA BORA","PPT","BOB","PPTBOB","Friday / Vendredi",0.70138893023384941,0.73611113921059501,"406","0",null,3.4722223877906799E-2,"ATR"]
["RANGIROA - TAHITI","RGI","PPT","RGIPPT","Friday / Vendredi",0.70138893023384941,0.743055616768731,"0574","0","Except. 10,17,24,31dec; 07jan; 18,25feb; 01,08,15apr",4.1666667908430099E-2,"ATR"]
["TAHITI - RAIATEA","PPT","RFP","PPTRFP","Friday / Vendredi",0.711805616768731,0.743055616768731,"376","0","10dec; 07jan; 01apr",3.125E-2,"ATR"]
["TIKEHAU - TAHITI","TIH","PPT","TIHPPT","Friday / Vendredi",0.72222224369896781,0.7604167212571038,"550","0",null,3.81944440305233E-2,"ATR"]
["RAIATEA - BORA BORA","RFP","BOB","RFPBOB","Friday / Vendredi",0.73958334818734062,0.75347224369896781,"442","0",null,1.3888888992369175E-2,"ATR"]
["RAIATEA - TAHITI","RFP","PPT","RFPPPT","Friday / Vendredi",0.73958334818734062,0.80208334818734062,"442","1",null,6.25E-2,"ATR"]
["BORA BORA - TAHITI","BOB","PPT","BOBPPT","Friday / Vendredi",0.75000003472222221,0.78472224369896781,"406","0",null,3.4722223877906799E-2,"ATR"]
["RAIATEA - TAHITI","RFP","PPT","RFPPPT","Friday / Vendredi",0.75694445267571342,0.78819445267571342,"376","0","10dec; 07jan; 01apr",3.125E-2,"ATR"]
["BORA BORA - TAHITI","BOB","PPT","BOBPPT","Friday / Vendredi",0.76736113921059501,0.80208334818734062,"442","0",null,3.4722223877906799E-2,"ATR"]
["TAHITI - HUAHINE","PPT","HUH","PPTHUH","Friday / Vendredi",0.78125,0.80902777777777779,"380","0",null,2.777777798473835E-2,"ATR"]
["TAHITI - RAIATEA","PPT","RFP","PPTRFP","Friday / Vendredi",0.78125,0.83680555555555547,"380","1",null,5.55555559694767E-2,"ATR"]
["HUAHINE - RAIATEA","HUH","RFP","HUHRFP","Friday / Vendredi",0.82291666666666663,0.83680555555555547,"380","0",null,1.3888888992369175E-2,"ATR"]
["HUAHINE - TAHITI","HUH","PPT","HUHPPT","Friday / Vendredi",0.82291666666666663,0.88194444444444453,"380","1",null,5.9027776122093201E-2,"ATR"]
["RAIATEA - TAHITI","RFP","PPT","RFPPPT","Friday / Vendredi",0.85069444444444453,0.88194444444444453,"380","0",null,3.125E-2,"ATR"]
["HUAHINE - TAHITI","HUH","PPT","HUHPPT","Friday / Vendredi",0.80555555555555547,0.83333333333333337,"359",null,null,2.7777777777777776E-2,"ATR"]
["RAIATEA - HUAHINE","RFP","HUH","RFPHUH","Friday / Vendredi",0.77777777777777779,0.79166666666666663,"359",null,null,1.3888888888888888E-2,"ATR"]
["TAHITI - HUAHINE","PPT","HUH","PPTHUH","Friday / Vendredi",0.73263888888888884,0.79166666666666663,"359",null,null,5.9027777777777783E-2,"ATR"]
["TAHITI - RAIATEA","PPT","RFP","PPTRFP","Friday / Vendredi",0.73263888888888884,0.76388888888888884,"359",null,null,3.125E-2,"ATR"]
["RAIATEA - TAHITI","RFP","PPT","RFPPPT","Friday / Vendredi",0.77777777777777779,0.83333333333333337,"359",null,null,5.5555555555555552E-2,"ATR"]
["TAHITI - HIVA OA (ATUONA)","PPT","AUQ","PPTAUQ","Saturday / Samedi",0.21875003472222221,0.37847224369896781,"851","0",null,0.1388888955116272,"ATR"]
["TAHITI - NUKU HIVA","PPT","NHV","PPTNHV","Saturday / Samedi",0.21875003472222221,0.427083377989663,"851","1",null,0.1875,"ATR"]
["TAHITI - RAIATEA","PPT","RFP","PPTRFP","Saturday / Samedi",0.22916670635594261,0.26041669145478141,"328","0","11,18,25dec; 01,08jan; 19feb; 02,09apr",3.125E-2,"ATR"]
["TAHITI - HUAHINE","PPT","HUH","PPTHUH","Saturday / Samedi",0.22916670635594261,0.28819448247803581,"328","1","11,18,25dec; 01,08jan; 19feb; 02,09apr",5.9027776122093201E-2,"ATR"]
["TAHITI - RAIATEA","PPT","RFP","PPTRFP","Saturday / Samedi",0.25000003472222221,0.28125003472222221,"374","0",null,3.125E-2,"ATR"]
["TAHITI - HUAHINE","PPT","HUH","PPTHUH","Saturday / Samedi",0.25000003472222221,0.3090278257454766,"374","1",null,5.9027776122093201E-2,"ATR"]
["TAHITI - TIKEHAU","PPT","TIH","PPTTIH","Saturday / Samedi",0.29166666666666669,0.3298611111111111,"556","0",null,3.81944440305233E-2,"ATR"]
["TAHITI - RANGIROA","PPT","RGI","PPTRGI","Saturday / Samedi",0.29166666666666669,0.3576388888888889,"556","1",null,6.5972223877906799E-2,"ATR"]
["RAIATEA - HUAHINE","RFP","HUH","RFPHUH","Saturday / Samedi",0.27430558696640861,0.28819448247803581,"328","0","11,18,25dec; 01,08jan; 19feb; 02,09apr",1.3888888992369175E-2,"ATR"]
["RAIATEA - TAHITI","RFP","PPT","RFPPPT","Saturday / Samedi",0.27430558696640861,0.32986113921059501,"328","1","11,18,25dec; 01,08jan; 19feb; 02,09apr",5.55555559694767E-2,"ATR"]
["TAHITI - BORA BORA","PPT","BOB","PPTBOB","Saturday / Samedi",0.28125003472222221,0.31597224369896781,"403","0",null,3.4722223877906799E-2,"ATR"]
["RAIATEA - HUAHINE","RFP","HUH","RFPHUH","Saturday / Samedi",0.29513893023384941,0.3090278257454766,"374","0",null,1.3888888992369175E-2,"ATR"]
["RAIATEA - TAHITI","RFP","PPT","RFPPPT","Saturday / Samedi",0.29513893023384941,0.35069448247803581,"374","1",null,5.55555559694767E-2,"ATR"]
["HUAHINE - TAHITI","HUH","PPT","HUHPPT","Saturday / Samedi",0.302083377989663,0.32986113921059501,"328","0","11,18,25dec; 01,08jan; 19feb; 02,09apr",2.777777798473835E-2,"ATR"]
["TAHITI - BORA BORA","PPT","BOB","PPTBOB","Saturday / Samedi",0.30555558696640861,0.3402778257454766,"436","0",null,3.4722223877906799E-2,"ATR"]
["TAHITI - RAIATEA","PPT","RFP","PPTRFP","Saturday / Samedi",0.30555558696640861,0.36805558696640861,"436","1",null,6.25E-2,"ATR"]
["TIKEHAU - RANGIROA","TIH","RGI","TIHRGI","Saturday / Samedi",0.34375,0.3576388888888889,"556","0",null,1.3888888992369175E-2,"ATR"]
["HUAHINE - TAHITI","HUH","PPT","HUHPPT","Saturday / Samedi",0.32291669145478141,0.35069448247803581,"374","0",null,2.777777798473835E-2,"ATR"]
["TIKEHAU - TAHITI","TIH","PPT","TIHPPT","Saturday / Samedi",0.34375,0.4201388888888889,"556","1",null,7.63888880610466E-2,"ATR"]
["BORA BORA - TAHITI","BOB","PPT","BOBPPT","Saturday / Samedi",0.32986113921059501,0.364583377989663,"403","0",null,3.4722223877906799E-2,"ATR"]
["TAHITI - HAO","PPT","HOI","PPTHOI","Saturday / Samedi",0.333333377989663,0.42361113921059501,"958","0","11dec; 16apr",9.0277776122093201E-2,"ATR"]
["TAHITI - GAMBIER","PPT","GMR","PPTGMR","Saturday / Samedi",0.333333377989663,0.53125003472222221,"954","0","Except. 13,27nov; 11dec; 08,15,29jan; 12feb; 05,19mar; 02,16apr",0.15625,"ATR"]
["TAHITI - GAMBIER","PPT","GMR","PPTGMR","Saturday / Samedi",0.333333377989663,0.53125003472222221,"959","0","08jan; 02apr",0.15625,"ATR"]
["TAHITI - GAMBIER","PPT","GMR","PPTGMR","Saturday / Samedi",0.333333377989663,0.56944445267571342,"958","1","11dec; 16apr",0.1944444477558136,"ATR"]
["TAHITI - RANGIROA","PPT","RGI","PPTRGI","Sunday / Dimanche",0.71875,0.75694444444444453,"512","0","12,19dec; 02,09jan; 20,227feb; 03,10,17apr",4.1666667908430099E-2,"ATR"]
["BORA BORA - RAIATEA","BOB","RFP","BOBRFP","Saturday / Samedi",0.35416669145478141,0.36805558696640861,"436","0",null,1.3888888992369175E-2,"ATR"]
["BORA BORA - TAHITI","BOB","PPT","BOBPPT","Saturday / Samedi",0.35416669145478141,0.41319448247803581,"436","1",null,5.9027776122093201E-2,"ATR"]
["RANGIROA - TAHITI","RGI","PPT","RGIPPT","Saturday / Samedi",0.37847222222222227,0.4201388888888889,"556","0",null,4.1666667908430099E-2,"ATR"]
["TAHITI - HUAHINE","PPT","HUH","PPTHUH","Saturday / Samedi",0.37500003472222221,0.4027778257454766,"311","0",null,2.777777798473835E-2,"ATR"]
["TAHITI - RAIATEA","PPT","RFP","PPTRFP","Saturday / Samedi",0.37500003472222221,0.4340278257454766,"311","1",null,5.9027776122093201E-2,"ATR"]
["RAIATEA - TAHITI","RFP","PPT","RFPPPT","Saturday / Samedi",0.38194448247803581,0.41319448247803581,"436","0",null,3.125E-2,"ATR"]
["TAHITI - MOOREA","PPT","MOZ","PPTMOZ","Saturday / Samedi",0.38541669145478141,0.395833377989663,"276","0",null,1.0416666977107525E-2,"ATR"]
["TAHITI - BORA BORA","PPT","BOB","PPTBOB","Saturday / Samedi",0.38541669145478141,0.44444448247803581,"276","1",null,5.9027776122093201E-2,"ATR"]
["HIVA OA (ATUONA) - NUKU HIVA","AUQ","NHV","AUQNHV","Saturday / Samedi",0.39930558696640861,0.427083377989663,"851","0",null,2.777777798473835E-2,"ATR"]
[{"$f":" CONCATENATE(VLOOKUP(B588,esc,2,0),\" - \",VLOOKUP(C588,esc,2,0))","v":"HIVA OA (ATUONA) - TAHITI"},"AUQ","PPT",{"$f":"CONCATENATE(B588,C588)","v":"AUQPPT"},"Saturday / Samedi",0.39930558696640861,0.5729167212571038,"851","1",null,0.1944444477558136,"ATR"]
["RANGIROA - TAHITI","RGI","PPT","RGIPPT","Sunday / Dimanche",0.77083333333333337,0.8125,"512","0","12,19dec; 02,09jan; 20,227feb; 03,10,17apr",4.1666667908430099E-2,"ATR"]
["MOOREA - BORA BORA","MOZ","BOB","MOZBOB","Saturday / Samedi",0.40972224369896781,0.44444448247803581,"276","0",null,3.4722223877906799E-2,"ATR"]
["HUAHINE - RAIATEA","HUH","RFP","HUHRFP","Saturday / Samedi",0.42013893023384941,0.4340278257454766,"311","0",null,1.3888888992369175E-2,"ATR"]
["TAHITI - HUAHINE","PPT","HUH","PPTHUH","Saturday / Samedi",0.44444444444444442,0.47222222222222227,"335","0","11,18,25dec; 01,08jan; 02,16apr",2.777777798473835E-2,"ATR"]
["TAHITI - RAIATEA","PPT","RFP","PPTRFP","Saturday / Samedi",0.44444444444444442,0.5,"335","1","11,18,25dec; 01,08jan; 02,16apr",5.55555559694767E-2,"ATR"]
["HUAHINE - TAHITI","HUH","PPT","HUHPPT","Saturday / Samedi",0.42013893023384941,0.47916669145478141,"311","1",null,5.9027776122093201E-2,"ATR"]
["TAHITI - RAIATEA","PPT","RFP","PPTRFP","Saturday / Samedi",0.4340278257454766,0.4652778257454766,"497","0",null,3.125E-2,"ATR"]
["TAHITI - BORA BORA","PPT","BOB","PPTBOB","Saturday / Samedi",0.4340278257454766,0.49305558696640861,"497","1",null,5.9027776122093201E-2,"ATR"]
["HAO - GAMBIER","HOI","GMR","HOIGMR","Saturday / Samedi",0.44444448247803581,0.56944445267571342,"958","0","11dec; 16apr",8.3333335816860199E-2,"ATR"]
["RAIATEA - TAHITI","RFP","PPT","RFPPPT","Saturday / Samedi",0.44791669145478141,0.47916669145478141,"311","0",null,3.125E-2,"ATR"]
["NUKU HIVA - TAHITI","NHV","PPT","NHVPPT","Saturday / Samedi",0.458333377989663,0.5729167212571038,"851","0",null,0.1354166716337204,"ATR"]
["HUAHINE - RAIATEA","HUH","RFP","HUHRFP","Saturday / Samedi",0.4861111111111111,0.5,"335","0","11,18,25dec; 01,08jan; 02,16apr",1.3888888992369175E-2,"ATR"]
["HUAHINE - TAHITI","HUH","PPT","HUHPPT","Saturday / Samedi",0.4861111111111111,0.54513888888888895,"335","1","11,18,25dec; 01,08jan; 02,16apr",5.9027776122093201E-2,"ATR"]
["BORA BORA - TAHITI","BOB","PPT","BOBPPT","Saturday / Samedi",0.4652778257454766,0.50000003472222221,"276","0",null,3.4722223877906799E-2,"ATR"]
["TAHITI - BORA BORA","PPT","BOB","PPTBOB","Saturday / Samedi",0.46875003472222221,0.50347224369896781,"450","0",null,3.4722223877906799E-2,"ATR"]
["RAIATEA - BORA BORA","RFP","BOB","RFPBOB","Saturday / Samedi",0.47916669145478141,0.49305558696640861,"497","0",null,1.3888888992369175E-2,"ATR"]
["RAIATEA - TAHITI","RFP","PPT","RFPPPT","Saturday / Samedi",0.47916669145478141,0.5416667212571038,"497","1",null,6.25E-2,"ATR"]
["RAIATEA - TAHITI","RFP","PPT","RFPPPT","Saturday / Samedi",0.51388888888888895,0.54513888888888895,"335","0","11,18,25dec; 01,08jan; 02,16apr",3.125E-2,"ATR"]
["TAHITI - RAIATEA","PPT","RFP","PPTRFP","Saturday / Samedi",0.50000003472222221,0.53125003472222221,"369","0",null,3.125E-2,"ATR"]
["TAHITI - HUAHINE","PPT","HUH","PPTHUH","Saturday / Samedi",0.50000003472222221,0.5590278257454766,"369","1",null,5.9027776122093201E-2,"ATR"]
["BORA BORA - TAHITI","BOB","PPT","BOBPPT","Saturday / Samedi",0.50694445267571342,0.5416667212571038,"497","0",null,3.4722223877906799E-2,"ATR"]
["TAHITI - RANGIROA","PPT","RGI","PPTRGI","Saturday / Samedi",0.524305616768731,0.56597224369896781,"534","0",null,4.1666667908430099E-2,"ATR"]
["BORA BORA - RANGIROA","BOB","RGI","BOBRGI","Saturday / Samedi",0.524305616768731,0.57638893023384941,"545","0",null,5.2083332091569901E-2,"ATR"]
["BORA BORA - TIKEHAU","BOB","TIH","BOBTIH","Saturday / Samedi",0.524305616768731,0.618055616768731,"545","1",null,9.375E-2,"ATR"]
["BORA BORA - FAKARAVA","BOB","FAV","BOBFAV","Saturday / Samedi",0.524305616768731,0.6215278257454766,"0545/0534","1#",null,9.7222223877906799E-2,"ATR/ATR"]
["TAHITI - FAKARAVA","PPT","FAV","PPTFAV","Saturday / Samedi",0.524305616768731,0.6215278257454766,"534","1",null,9.7222223877906799E-2,"ATR"]
["RAIATEA - HUAHINE","RFP","HUH","RFPHUH","Saturday / Samedi",0.54513893023384941,0.5590278257454766,"369","0",null,1.3888888992369175E-2,"ATR"]
["RAIATEA - TAHITI","RFP","PPT","RFPPPT","Saturday / Samedi",0.54513893023384941,0.60069445267571342,"369","1",null,5.55555559694767E-2,"ATR"]
["TAHITI - TUBUAI","PPT","TUB","PPTTUB","Saturday / Samedi",0.57291666666666663,0.64236111111111105,"926","0","11,18dec; 01,08jan",6.9444447755813599E-2,"ATR"]
["TAHITI - HUAHINE","PPT","HUH","PPTHUH","Saturday / Samedi",0.56250003472222221,0.5902778257454766,"444","0",null,2.777777798473835E-2,"ATR"]
["GAMBIER - HAO","GMR","HOI","GMRHOI","Saturday / Samedi",0.56250003472222221,0.60763893023384941,"959","0","08jan; 02apr",8.6805552244186401E-2,"ATR"]
["TAHITI - BORA BORA","PPT","BOB","PPTBOB","Saturday / Samedi",0.56250003472222221,0.6215278257454766,"444","1",null,5.9027776122093201E-2,"ATR"]
["GAMBIER - TAHITI","GMR","PPT","GMRPPT","Saturday / Samedi",0.56250003472222221,0.68750003472222221,"954","0","Except. 13,27nov; 11dec; 08,15,29jan; 12feb; 05,19mar; 02,16apr",0.1666666716337204,"ATR"]
["GAMBIER - TAHITI","GMR","PPT","GMRPPT","Saturday / Samedi",0.56250003472222221,0.72222224369896781,"959","1","08jan; 02apr",0.2013888955116272,"ATR"]
["HUAHINE - TAHITI","HUH","PPT","HUHPPT","Saturday / Samedi",0.5729167212571038,0.60069445267571342,"369","0",null,2.777777798473835E-2,"ATR"]
["RANGIROA - FAKARAVA","RGI","FAV","RGIFAV","Saturday / Samedi",0.5902778257454766,0.6215278257454766,"534","0",null,3.125E-2,"ATR"]
["RANGIROA - TAHITI","RGI","PPT","RGIPPT","Saturday / Samedi",0.5902778257454766,0.68750003472222221,"534","1",null,9.7222223877906799E-2,"ATR"]
["GAMBIER - TAHITI","GMR","PPT","GMRPPT","Saturday / Samedi",0.60069445267571342,0.72569445267571342,"958","0","11dec; 16apr",0.1666666716337204,"ATR"]
["RANGIROA - TIKEHAU","RGI","TIH","RGITIH","Saturday / Samedi",0.6041667212571038,0.618055616768731,"545","0",null,1.3888888992369175E-2,"ATR"]
["HUAHINE - BORA BORA","HUH","BOB","HUHBOB","Saturday / Samedi",0.6041667212571038,0.6215278257454766,"444","0",null,1.73611119389534E-2,"ATR"]
["RANGIROA - TAHITI","RGI","PPT","RGIPPT","Saturday / Samedi",0.6041667212571038,0.67013893023384941,"545","1",null,6.5972223877906799E-2,"ATR"]
["HUAHINE - TAHITI","HUH","PPT","HUHPPT","Saturday / Samedi",0.6041667212571038,0.67708334818734062,"444","1",null,7.2916664183139801E-2,"ATR"]
["TAHITI - BORA BORA","PPT","BOB","PPTBOB","Saturday / Samedi",0.61458334818734062,0.649305616768731,"419","0","11,18,25dec; 01,08jan; 02,09,16apr",3.4722223877906799E-2,"ATR"]
["TAHITI - RAIATEA","PPT","RFP","PPTRFP","Saturday / Samedi",0.62500003472222221,0.65625003472222221,"425","0",null,3.125E-2,"ATR"]
["TAHITI - BORA BORA","PPT","BOB","PPTBOB","Saturday / Samedi",0.62500003472222221,0.69097224369896781,"425","1",null,6.5972223877906799E-2,"ATR"]
["HAO - TAHITI","HOI","PPT","HOIPPT","Saturday / Samedi",0.62847224369896781,0.72222224369896781,"959","0","08jan; 02apr",9.375E-2,"ATR"]
["TIKEHAU - TAHITI","TIH","PPT","TIHPPT","Saturday / Samedi",0.63194445267571342,0.67013893023384941,"545","0",null,3.81944440305233E-2,"ATR"]
["FAKARAVA - TAHITI","FAV","PPT","FAVPPT","Saturday / Samedi",0.6354167212571038,0.68750003472222221,"534","0",null,5.2083332091569901E-2,"ATR"]
["BORA BORA - TAHITI","BOB","PPT","BOBPPT","Saturday / Samedi",0.64236113921059501,0.67708334818734062,"444","0",null,3.4722223877906799E-2,"ATR"]
["TUBUAI - TAHITI","TUB","PPT","TUBPPT","Saturday / Samedi",0.66319444444444442,0.73263888888888884,"926","0","11,18dec; 01,08jan",6.9444447755813599E-2,"ATR"]
["BORA BORA - TAHITI","BOB","PPT","BOBPPT","Saturday / Samedi",0.67361113921059501,0.70833334818734062,"419","0","11,18,25dec; 01,08jan; 02,09,16apr",3.4722223877906799E-2,"ATR"]
["RAIATEA - BORA BORA","RFP","BOB","RFPBOB","Saturday / Samedi",0.67708334818734062,0.69097224369896781,"425","0",null,1.3888888992369175E-2,"ATR"]
["RAIATEA - TAHITI","RFP","PPT","RFPPPT","Saturday / Samedi",0.67708334818734062,0.73958334818734062,"425","1",null,6.25E-2,"ATR"]
["BORA BORA - TAHITI","BOB","PPT","BOBPPT","Saturday / Samedi",0.70486113921059501,0.73958334818734062,"425","0",null,3.4722223877906799E-2,"ATR"]
["TAHITI - BORA BORA","PPT","BOB","PPTBOB","Saturday / Samedi",0.71875,0.75347222222222221,"461","0",null,3.4722223877906799E-2,"ATR"]
["TAHITI - BORA BORA","PPT","BOB","PPTBOB","Saturday / Samedi",0.71875003472222221,0.75347224369896781,"0482","0",null,3.4722223877906799E-2,"ATR"]
["TAHITI - HUAHINE","PPT","HUH","PPTHUH","Saturday / Samedi",0.7291667212571038,0.75694445267571342,"302","0","11,18dec; 01,08jan",2.777777798473835E-2,"ATR"]
["TAHITI - RAIATEA","PPT","RFP","PPTRFP","Saturday / Samedi",0.7291667212571038,0.78472224369896781,"302","1","11,18dec; 01,08jan",5.55555559694767E-2,"ATR"]
["BORA BORA - TAHITI","BOB","PPT","BOBPPT","Saturday / Samedi",0.77083333333333337,0.80555555555555547,"461","0",null,3.4722223877906799E-2,"ATR"]
["BORA BORA - TAHITI","BOB","PPT","BOBPPT","Saturday / Samedi",0.76736113921059501,0.80208334818734062,"0482","0",null,3.4722223877906799E-2,"ATR"]
["HUAHINE - RAIATEA","HUH","RFP","HUHRFP","Saturday / Samedi",0.77083334818734062,0.78472224369896781,"302","0","11,18dec; 01,08jan",1.3888888992369175E-2,"ATR"]
["HUAHINE - TAHITI","HUH","PPT","HUHPPT","Saturday / Samedi",0.77083334818734062,0.82986113921059501,"302","1","11,18dec; 01,08jan",5.9027776122093201E-2,"ATR"]
["RAIATEA - TAHITI","RFP","PPT","RFPPPT","Saturday / Samedi",0.79861113921059501,0.82986113921059501,"302","0","11,18dec; 01,08jan",3.125E-2,"ATR"]
[{"$f":" CONCATENATE(VLOOKUP(B652,esc,2,0),\" - \",VLOOKUP(C652,esc,2,0))","v":"TAHITI - NUKU HIVA"},"PPT","NHV",{"$f":"CONCATENATE(B652,C652)","v":"PPTNHV"},"Sunday / Dimanche",0.22916670635594261,0.38541669145478141,"839","0","Except. 14,21,28nov; 05dec; 16,23,30jan; 06feb",0.1354166716337204,"ATR"]
["TAHITI - HIVA OA (ATUONA)","PPT","AUQ","PPTAUQ","Sunday / Dimanche",0.22916670635594261,0.44444448247803581,"839","1","Except. 14,21,28nov; 05dec; 16,23,30jan; 06feb",0.1944444477558136,"ATR"]
["TAHITI - HIVA OA (ATUONA)","PPT","AUQ","PPTAUQ","Sunday / Dimanche",0.25000003472222221,0.40972224369896781,"821","0",null,0.1388888955116272,"ATR"]
["TAHITI - NUKU HIVA","PPT","NHV","PPTNHV","Sunday / Dimanche",0.25000003472222221,0.458333377989663,"821","1",null,0.1875,"ATR"]
["TAHITI - HAO","PPT","HOI","PPTHOI","Sunday / Dimanche",0.270833377989663,0.36111113921059501,"949","0",null,9.0277776122093201E-2,"ATR"]
["TAHITI - MAKEMO","PPT","MKP","PPTMKP","Sunday / Dimanche",0.270833377989663,0.42361113921059501,"949","1",null,0.1527777761220932,"ATR"]
["TAHITI - BORA BORA","PPT","BOB","PPTBOB","Sunday / Dimanche",0.28125003472222221,0.31597224369896781,"480","0","12,19,26dec; 02,09jan",3.4722223877906799E-2,"ATR"]
["TAHITI - HUAHINE","PPT","HUH","PPTHUH","Sunday / Dimanche",0.28125003472222221,0.34722224369896781,"480","1","12,19,26dec; 02,09jan",6.5972223877906799E-2,"ATR"]
["TAHITI - MAUPITI","PPT","MAU","PPTMAU","Sunday / Dimanche",0.29166669145478141,0.32986113921059501,"715","0","19,26dec; 02jan; 03,10apr",3.81944440305233E-2,"ATR"]
["TAHITI - HUAHINE","PPT","HUH","PPTHUH","Sunday / Dimanche",0.302083377989663,0.32986113921059501,"370","0",null,2.777777798473835E-2,"ATR"]
["TAHITI - RAIATEA","PPT","RFP","PPTRFP","Sunday / Dimanche",0.302083377989663,0.35763893023384941,"370","1",null,5.55555559694767E-2,"ATR"]
["TAHITI - BORA BORA","PPT","BOB","PPTBOB","Sunday / Dimanche",0.32291669145478141,0.35763893023384941,"409","0",null,3.4722223877906799E-2,"ATR"]
["BORA BORA - HUAHINE","BOB","HUH","BOBHUH","Sunday / Dimanche",0.32986113921059501,0.34722224369896781,"480","0","12,19,26dec; 02,09jan",1.73611119389534E-2,"ATR"]
["BORA BORA - TAHITI","BOB","PPT","BOBPPT","Sunday / Dimanche",0.32986113921059501,0.3888888888888889,"480","1","12,19,26dec; 02,09jan",5.9027776122093201E-2,"ATR"]
["TAHITI - MOOREA","PPT","MOZ","PPTMOZ","Sunday / Dimanche",0.333333377989663,0.34375003472222221,"455","0",null,1.0416666977107525E-2,"ATR"]
["TAHITI - RAIATEA","PPT","RFP","PPTRFP","Sunday / Dimanche",0.333333377989663,0.38888893023384941,"455","1",null,5.55555559694767E-2,"ATR"]
["TAHITI - BORA BORA","PPT","BOB","PPTBOB","Sunday / Dimanche",0.333333377989663,0.41666669145478141,"455","2",null,8.3333335816860199E-2,"ATR"]
["HUAHINE - RAIATEA","HUH","RFP","HUHRFP","Sunday / Dimanche",0.34375003472222221,0.35763893023384941,"370","0",null,1.3888888992369175E-2,"ATR"]
["MAUPITI - TAHITI","MAU","PPT","MAUPPT","Sunday / Dimanche",0.34375003472222221,0.37847224369896781,"715","0","19,26dec; 02jan; 03,10apr",3.4722223877906799E-2,"ATR"]
["HUAHINE - TAHITI","HUH","PPT","HUHPPT","Sunday / Dimanche",0.34375003472222221,0.4027778257454766,"370","1",null,5.9027776122093201E-2,"ATR"]
["MOOREA - RAIATEA","MOZ","RFP","MOZRFP","Sunday / Dimanche",0.35763893023384941,0.38888893023384941,"455","0",null,3.125E-2,"ATR"]
["MOOREA - BORA BORA","MOZ","BOB","MOZBOB","Sunday / Dimanche",0.35763893023384941,0.41666669145478141,"455","1",null,5.9027776122093201E-2,"ATR"]
["HUAHINE - TAHITI","HUH","PPT","HUHPPT","Sunday / Dimanche",0.36111113921059501,0.38888893023384941,"480","0","12,19,26dec; 02,09jan",2.777777798473835E-2,"ATR"]
["RAIATEA - TAHITI","RFP","PPT","RFPPPT","Sunday / Dimanche",0.3715278257454766,0.4027778257454766,"370","0",null,3.125E-2,"ATR"]
["BORA BORA - TAHITI","BOB","PPT","BOBPPT","Sunday / Dimanche",0.3715278257454766,0.40625003472222221,"409","0",null,3.4722223877906799E-2,"ATR"]
["HAO - MAKEMO","HOI","MKP","HOIMKP","Sunday / Dimanche",0.38194448247803581,0.42361113921059501,"949","0",null,4.1666667908430099E-2,"ATR"]
["HAO - TAHITI","HOI","PPT","HOIPPT","Sunday / Dimanche",0.38194448247803581,0.51388893023384941,"949","1",null,0.1319444477558136,"ATR"]
["TAHITI - ARUTUA","PPT","AXR","PPTAXR","Sunday / Dimanche",0.39930558696640861,0.44444448247803581,"579","0","12,19,26dec; 02,09jan; 20,27feb; 03,10,17apr",4.51388880610466E-2,"ATR"]
["RAIATEA - BORA BORA","RFP","BOB","RFPBOB","Sunday / Dimanche",0.4027778257454766,0.41666669145478141,"455","0",null,1.3888888992369175E-2,"ATR"]
["RAIATEA - RANGIROA","RFP","RGI","RFPRGI","Sunday / Dimanche",0.4027778257454766,0.489583377989663,"0455/0541","1",null,8.6805552244186401E-2,"ATR"]
["RAIATEA - TIKEHAU","RFP","TIH","RFPTIH","Sunday / Dimanche",0.4027778257454766,0.524305616768731,"0455/0541","2",null,0.1215277761220932,"ATR"]
["NUKU HIVA - HIVA OA (ATUONA)","NHV","AUQ","NHVAUQ","Sunday / Dimanche",0.41666669145478141,0.44444448247803581,"839","0","Except. 14,21,28nov; 05dec; 16,23,30jan; 06feb",2.777777798473835E-2,"ATR"]
["TAHITI - RURUTU","PPT","RUR","PPTRUR","Sunday / Dimanche",0.41666669145478141,0.47916669145478141,"928","0","12,19dec; 02,09jan",6.25E-2,"ATR"]
["NUKU HIVA - TAHITI","NHV","PPT","NHVPPT","Sunday / Dimanche",0.41666669145478141,0.58333334818734062,"839","1","Except. 14,21,28nov; 05dec; 16,23,30jan; 06feb",0.1875,"ATR"]
["TAHITI - BORA BORA","PPT","BOB","PPTBOB","Sunday / Dimanche",0.427083377989663,0.46180558696640861,"413","0",null,3.4722223877906799E-2,"ATR"]
["TAHITI - RAIATEA","PPT","RFP","PPTRFP","Sunday / Dimanche",0.427083377989663,0.489583377989663,"413","1",null,6.25E-2,"ATR"]
["HIVA OA (ATUONA) - NUKU HIVA","AUQ","NHV","AUQNHV","Sunday / Dimanche",0.43055558696640861,0.458333377989663,"821","0",null,2.777777798473835E-2,"ATR"]
["HIVA OA (ATUONA) - TAHITI","AUQ","PPT","AUQPPT","Sunday / Dimanche",0.43055558696640861,0.6041667212571038,"821","1",null,0.1944444477558136,"ATR"]
["BORA BORA - RANGIROA","BOB","RGI","BOBRGI","Sunday / Dimanche",0.43750003472222221,0.489583377989663,"541","0",null,5.2083332091569901E-2,"ATR"]
["BORA BORA - TIKEHAU","BOB","TIH","BOBTIH","Sunday / Dimanche",0.43750003472222221,0.524305616768731,"541","1",null,8.6805552244186401E-2,"ATR"]
["TAHITI - MOOREA","PPT","MOZ","PPTMOZ","Sunday / Dimanche",0.44097224369896781,0.45138893023384941,"260","0",null,1.0416666977107525E-2,"ATR"]
["TAHITI - BORA BORA","PPT","BOB","PPTBOB","Sunday / Dimanche",0.44097224369896781,0.50000003472222221,"260","1",null,5.9027776122093201E-2,"ATR"]
["MAKEMO - TAHITI","MKP","PPT","MKPPPT","Sunday / Dimanche",0.44444448247803581,0.51388893023384941,"949","0",null,6.9444447755813599E-2,"ATR"]
["ARUTUA - TAHITI","AXR","PPT","AXRPPT","Sunday / Dimanche",0.458333377989663,0.50347224369896781,"579","0","12,19,26dec; 02,09jan; 20,27feb; 03,10,17apr",4.51388880610466E-2,"ATR"]
["MOOREA - BORA BORA","MOZ","BOB","MOZBOB","Sunday / Dimanche",0.4652778257454766,0.50000003472222221,"260","0",null,3.4722223877906799E-2,"ATR"]
["HIVA OA (ATUONA) - TAHITI","AUQ","PPT","AUQPPT","Sunday / Dimanche",0.4652778257454766,0.58333334818734062,"839","0","Except. 14,21,28nov; 05dec; 16,23,30jan; 06feb",0.1388888955116272,"ATR"]
["BORA BORA - RAIATEA","BOB","RFP","BOBRFP","Sunday / Dimanche",0.47569448247803581,0.489583377989663,"413","0",null,1.3888888992369175E-2,"ATR"]
["BORA BORA - TAHITI","BOB","PPT","BOBPPT","Sunday / Dimanche",0.47569448247803581,0.53472224369896781,"413","1",null,5.9027776122093201E-2,"ATR"]
["TAHITI - AHE","PPT","AHE","PPTAHE","Sunday / Dimanche",0.48263893023384941,0.53472224369896781,"520","0","12,19dec; 02,09jan; 03,17apr",5.2083332091569901E-2,"ATR"]
["TAHITI - AHE","PPT","AHE","PPTAHE","Sunday / Dimanche",0.48263893023384941,0.53472224369896781,"590","0","26dec; 20,27feb; 10apr",5.2083332091569901E-2,"ATR"]
["TAHITI - MANIHI","PPT","XMH","PPTXMH","Sunday / Dimanche",0.48263893023384941,0.555555616768731,"590","1","26dec; 20,27feb; 10apr",7.2916664183139801E-2,"ATR"]
["NUKU HIVA - TAHITI","NHV","PPT","NHVPPT","Sunday / Dimanche",0.489583377989663,0.6041667212571038,"821","0",null,0.1354166716337204,"ATR"]
["TAHITI - ARUTUA","PPT","AXR","PPTAXR","Sunday / Dimanche",0.50000003472222221,0.54513893023384941,"587","0","Except. 12,19,26dec; 02,09jan; 20,27feb; 03,10,17apr",4.51388880610466E-2,"ATR"]
["RURUTU - TAHITI","RUR","PPT","RURPPT","Sunday / Dimanche",0.50000003472222221,0.56250003472222221,"928","0","12,19dec; 02,09jan",6.25E-2,"ATR"]
["TAHITI - AHE","PPT","AHE","PPTAHE","Sunday / Dimanche",0.50000003472222221,0.5729167212571038,"587","1","Except. 12,19,26dec; 02,09jan; 20,27feb; 03,10,17apr",7.2916664183139801E-2,"ATR"]
["TAHITI - MANIHI","PPT","XMH","PPTXMH","Sunday / Dimanche",0.50000003472222221,0.59375003472222221,"587","2","Except. 12,19,26dec; 02,09jan; 20,27feb; 03,10,17apr",9.375E-2,"ATR"]
["RAIATEA - TAHITI","RFP","PPT","RFPPPT","Sunday / Dimanche",0.50347224369896781,0.53472224369896781,"413","0",null,3.125E-2,"ATR"]
["RANGIROA - TIKEHAU","RGI","TIH","RGITIH","Sunday / Dimanche",0.5104167212571038,0.524305616768731,"541","0",null,1.3888888992369175E-2,"ATR"]
["RANGIROA - TAHITI","RGI","PPT","RGIPPT","Sunday / Dimanche",0.5104167212571038,0.57638893023384941,"541","1",null,6.5972223877906799E-2,"ATR"]
["BORA BORA - TAHITI","BOB","PPT","BOBPPT","Sunday / Dimanche",0.52083334818734062,0.555555616768731,"260","0",null,3.4722223877906799E-2,"ATR"]
["TAHITI - MAUPITI","PPT","MAU","PPTMAU","Sunday / Dimanche",0.524305616768731,0.56250003472222221,"740","0",null,3.81944440305233E-2,"ATR"]
["TAHITI - MATAIVA","PPT","MVT","PPTMVT","Sunday / Dimanche",0.53472224369896781,0.5729167212571038,"558","0",null,3.81944440305233E-2,"ATR"]
["TAHITI - RANGIROA","PPT","RGI","PPTRGI","Sunday / Dimanche",0.53472224369896781,0.6041667212571038,"558","1",null,6.9444447755813599E-2,"ATR"]
["TIKEHAU - TAHITI","TIH","PPT","TIHPPT","Sunday / Dimanche",0.53819445267571342,0.57638893023384941,"541","0",null,3.81944440305233E-2,"ATR"]
[{"$f":" CONCATENATE(VLOOKUP(B716,esc,2,0),\" - \",VLOOKUP(C716,esc,2,0))","v":"AHE - MANIHI"},"AHE","XMH",{"$f":"CONCATENATE(B716,C716)","v":"AHEXMH"},"Sunday / Dimanche",0.54861113921059501,0.555555616768731,"590","0","26dec; 20,27feb; 10apr",6.9444444961845875E-3,"ATR"]
["AHE - TAHITI","AHE","PPT","AHEPPT","Sunday / Dimanche",0.54861113921059501,0.60069445267571342,"520","0","12,19dec; 02,09jan; 03,17apr",5.2083332091569901E-2,"ATR"]
["AHE - TAHITI","AHE","PPT","AHEPPT","Sunday / Dimanche",0.54861113921059501,0.62500003472222221,"590","1","26dec; 20,27feb; 10apr",7.63888880610466E-2,"ATR"]
["ARUTUA - TAHITI","AXR","PPT","AXRPPT","Sunday / Dimanche",0.5590278257454766,0.66319445267571342,"587","2","Except. 12,19,26dec; 02,09jan; 20,27feb; 03,10,17apr",0.1041666641831398,"ATR"]
["TAHITI - BORA BORA","PPT","BOB","PPTBOB","Sunday / Dimanche",0.56250003472222221,0.59722224369896781,"424","0",null,3.4722223877906799E-2,"ATR"]
["TAHITI - MAUPITI","PPT","MAU","PPTMAU","Sunday / Dimanche",0.56250003472222221,0.6354167212571038,"0424/0742","1#",null,7.2916664183139801E-2,"ATR/ATR"]
["MANIHI - TAHITI","XMH","PPT","XMHPPT","Sunday / Dimanche",0.56944445267571342,0.62500003472222221,"590","0","26dec; 20,27feb; 10apr",5.55555559694767E-2,"ATR"]
["MAUPITI - BORA BORA","MAU","BOB","MAUBOB","Sunday / Dimanche",0.57638893023384941,0.5902778257454766,"740","0",null,1.3888888992369175E-2,"ATR"]
["TAHITI - RANGIROA","PPT","RGI","PPTRGI","Sunday / Dimanche",0.57638893023384941,0.618055616768731,"563","0",null,4.1666667908430099E-2,"ATR"]
["MAUPITI - TAHITI","MAU","PPT","MAUPPT","Sunday / Dimanche",0.57638893023384941,0.64583334818734062,"740/424","1#",null,6.9444447755813599E-2,"ATR/ATR"]
["TAHITI - FAKARAVA","PPT","FAV","PPTFAV","Sunday / Dimanche",0.57638893023384941,0.6666667212571038,"563","1",null,9.0277776122093201E-2,"ATR"]
["AHE - MANIHI","AHE","XMH","AHEXMH","Sunday / Dimanche",0.586805616768731,0.59375003472222221,"587","0","Except. 12,19,26dec; 02,09jan; 20,27feb; 03,10,17apr",6.9444444961845875E-3,"ATR"]
["MATAIVA - RANGIROA","MVT","RGI","MVTRGI","Sunday / Dimanche",0.586805616768731,0.6041667212571038,"558","0",null,1.73611119389534E-2,"ATR"]
["AHE - TAHITI","AHE","PPT","AHEPPT","Sunday / Dimanche",0.586805616768731,0.66319445267571342,"587","1","Except. 12,19,26dec; 02,09jan; 20,27feb; 03,10,17apr",7.63888880610466E-2,"ATR"]
["MATAIVA - TAHITI","MVT","PPT","MVTPPT","Sunday / Dimanche",0.586805616768731,0.6666667212571038,"558","1",null,7.98611119389534E-2,"ATR"]
["TAHITI - BORA BORA","PPT","BOB","PPTBOB","Sunday / Dimanche",0.6041667212571038,0.63888893023384941,"0491","0",null,3.4722223877906799E-2,"ATR"]
["MANIHI - TAHITI","XMH","PPT","XMHPPT","Sunday / Dimanche",0.60763893023384941,0.66319445267571342,"587","0","Except. 12,19,26dec; 02,09jan; 20,27feb; 03,10,17apr",5.55555559694767E-2,"ATR"]
["BORA BORA - TAHITI","BOB","PPT","BOBPPT","Sunday / Dimanche",0.61111111111111105,0.64583334818734062,"424","0",null,3.4722223877906799E-2,"ATR"]
["TAHITI - RURUTU","PPT","RUR","PPTRUR","Sunday / Dimanche",0.61458334818734062,0.67708334818734062,"933","0",null,6.25E-2,"ATR"]
["TAHITI - TUBUAI","PPT","TUB","PPTTUB","Sunday / Dimanche",0.61458334818734062,0.72569445267571342,"933","1",null,0.1111111119389534,"ATR"]
["BORA BORA - MAUPITI","BOB","MAU","BOBMAU","Sunday / Dimanche",0.6215278257454766,0.6354167212571038,"742","0",null,1.3888888992369175E-2,"ATR"]
["RANGIROA - TAHITI","RGI","PPT","RGIPPT","Sunday / Dimanche",0.62500003472222221,0.6666667212571038,"558","0",null,4.1666667908430099E-2,"ATR"]
["TAHITI - MANIHI","PPT","XMH","PPTXMH","Sunday / Dimanche",0.62500003472222221,0.67708334818734062,"596","0","12,19dec; 02,09jan; 03,17apr",5.2083332091569901E-2,"ATR"]
["RANGIROA - FAKARAVA","RGI","FAV","RGIFAV","Sunday / Dimanche",0.6354167212571038,0.6666667212571038,"563","0",null,3.125E-2,"ATR"]
["TAHITI - TIKEHAU","PPT","TIH","PPTTIH","Sunday / Dimanche",0.60416666666666663,0.64236111111111105,"504","0",null,3.81944440305233E-2,"ATR"]
["TAHITI - RANGIROA","PPT","RGI","PPTRGI","Sunday / Dimanche",0.60416666666666663,0.67013888888888884,"504","1",null,6.5972223877906799E-2,"ATR"]
["RANGIROA - TAHITI","RGI","PPT","RGIPPT","Sunday / Dimanche",0.6354167212571038,0.73263893023384941,"563","1",null,9.7222223877906799E-2,"ATR"]
["MAUPITI - TAHITI","MAU","PPT","MAUPPT","Sunday / Dimanche",0.649305616768731,0.6840278257454766,"742","0",null,3.4722223877906799E-2,"ATR"]
["BORA BORA - TAHITI","BOB","PPT","BOBPPT","Sunday / Dimanche",0.6527778257454766,0.68750003472222221,"0491","0",null,3.4722223877906799E-2,"ATR"]
["TAHITI - HUAHINE","PPT","HUH","PPTHUH","Sunday / Dimanche",0.6666667212571038,0.69097224369896781,"446","0",null,2.43055559694767E-2,"ATR"]
["TAHITI - BORA BORA","PPT","BOB","PPTBOB","Sunday / Dimanche",0.6666667212571038,0.72222224369896781,"446","1",null,5.55555559694767E-2,"ATR"]
["TAHITI - RAIATEA","PPT","RFP","PPTRFP","Sunday / Dimanche",0.6666667212571038,0.75000003472222221,446,"2",null,8.3333335816860199E-2,"ATR"]
["FAKARAVA - TAHITI","FAV","PPT","FAVPPT","Sunday / Dimanche",0.680555616768731,0.73263893023384941,"563","0",null,5.2083332091569901E-2,"ATR"]
["TIKEHAU - RANGIROA","TIH","RGI","TIHRGI","Sunday / Dimanche",0.65625,0.67013888888888884,"504","0",null,1.3888888992369175E-2,"ATR"]
["TAHITI - RAIATEA","PPT","RFP","PPTRFP","Sunday / Dimanche",0.68750003472222221,0.71875003472222221,"437","0",null,3.125E-2,"ATR"]
["TAHITI - BORA BORA","PPT","BOB","PPTBOB","Sunday / Dimanche",0.68750003472222221,0.7465278257454766,"437","1",null,5.9027776122093201E-2,"ATR"]
["TIKEHAU - TAHITI","TIH","PPT","TIHPPT","Sunday / Dimanche",0.65625,0.73263888888888884,"504","1",null,7.63888880610466E-2,"ATR"]
["MANIHI - TAHITI","XMH","PPT","XMHPPT","Sunday / Dimanche",0.69097224369896781,0.7465278257454766,"596","0","12,19dec; 02,09jan; 03,17apr",5.55555559694767E-2,"ATR"]
["TAHITI - RAIATEA","PPT","RFP","PPTRFP","Sunday / Dimanche",0.69444445267571342,0.72569445267571342,"0364","0","28nov",3.125E-2,"ATR"]
["TAHITI - HUAHINE","PPT","HUH","PPTHUH","Sunday / Dimanche",0.69444445267571342,0.75347224369896781,"0364","1","28nov",5.9027776122093201E-2,"ATR"]
["RURUTU - TUBUAI","RUR","TUB","RURTUB","Sunday / Dimanche",0.6979167212571038,0.72569445267571342,"933","0",null,2.777777798473835E-2,"ATR"]
["RURUTU - TAHITI","RUR","PPT","RURPPT","Sunday / Dimanche",0.6979167212571038,0.81597224369896781,"933","1",null,0.1180555522441864,"ATR"]
["HUAHINE - BORA BORA","HUH","BOB","HUHBOB","Sunday / Dimanche",0.70486113921059501,0.72222224369896781,"446","0",null,1.73611119389534E-2,"ATR"]
["HUAHINE - RAIATEA","HUH","RFP","HUHRFP","Sunday / Dimanche",0.70486113921059501,0.75000003472222221,"446","1",null,4.51388880610466E-2,"ATR"]
["HUAHINE - TAHITI","HUH","PPT","HUHPPT","Sunday / Dimanche",0.70486113921059501,0.79513893023384941,446,"2",null,9.0277776122093201E-2,"ATR"]
["TAHITI - BORA BORA","PPT","BOB","PPTBOB","Sunday / Dimanche",0.63541666666666663,0.66666666666666663,"462","0",null,3.125E-2,"ATR"]
["TAHITI - HUAHINE","PPT","HUH","PPTHUH","Sunday / Dimanche",0.63541666666666663,0.69791666666666663,"462","1",null,6.25E-2,"ATR"]
["RANGIROA - TAHITI","RGI","PPT","RGIPPT","Sunday / Dimanche",0.69097222222222221,0.73263888888888884,"504","0",null,4.1666667908430099E-2,"ATR"]
["RAIATEA - BORA BORA","RFP","BOB","RFPBOB","Sunday / Dimanche",0.73263893023384941,0.7465278257454766,"437","0",null,1.3888888992369175E-2,"ATR"]
["RAIATEA - TAHITI","RFP","PPT","RFPPPT","Sunday / Dimanche",0.73263893023384941,0.80208334818734062,"437","1",null,6.9444447755813599E-2,"ATR"]
["BORA BORA - RAIATEA","BOB","RFP","BOBRFP","Sunday / Dimanche",0.73611113921059501,0.75000003472222221,"446","0",null,1.3888888992369175E-2,"ATR"]
["BORA BORA - TAHITI","BOB","PPT","BOBPPT","Sunday / Dimanche",0.73611113921059501,0.79513893023384941,"446","1",null,5.9027776122093201E-2,"ATR"]
["RAIATEA - HUAHINE","RFP","HUH","RFPHUH","Sunday / Dimanche",0.73958334818734062,0.75347224369896781,"0364","0","28nov",1.3888888992369175E-2,"ATR"]
["RAIATEA - TAHITI","RFP","PPT","RFPPPT","Sunday / Dimanche",0.73958334818734062,0.79513893023384941,"0364","1","28nov",5.55555559694767E-2,"ATR"]
["TUBUAI - TAHITI","TUB","PPT","TUBPPT","Sunday / Dimanche",0.7465278257454766,0.81597224369896781,"933","0",null,6.9444447755813599E-2,"ATR"]
["BORA BORA - HUAHINE","BOB","HUH","BOBHUH","Sunday / Dimanche",0.68055555555555547,0.69791666666666663,"462","0",null,1.73611119389534E-2,"ATR"]
["TAHITI - HUAHINE","PPT","HUH","PPTHUH","Sunday / Dimanche",0.76388888888888884,0.79166666666666663,"325","0","12,19,26dec; 02,09jan; 20,27feb; 03,10,17apr",2.777777798473835E-2,"ATR"]
["TAHITI - RAIATEA","PPT","RFP","PPTRFP","Sunday / Dimanche",0.76388888888888884,0.81944444444444453,"325","1","12,19,26dec; 02,09jan; 20,27feb; 03,10,17apr",5.55555559694767E-2,"ATR"]
["BORA BORA - TAHITI","BOB","PPT","BOBPPT","Sunday / Dimanche",0.68055555555555547,0.73958333333333337,"462","1",null,5.9027776122093201E-2,"ATR"]
["RAIATEA - TAHITI","RFP","PPT","RFPPPT","Sunday / Dimanche",0.76388893023384941,0.79513893023384941,"446","0",null,3.125E-2,"ATR"]
["HUAHINE - TAHITI","HUH","PPT","HUHPPT","Sunday / Dimanche",0.76736113921059501,0.79513893023384941,"0364","0","28nov",2.777777798473835E-2,"ATR"]
["BORA BORA - TAHITI","BOB","PPT","BOBPPT","Sunday / Dimanche",0.76736113921059501,0.80208334818734062,"437","0",null,3.4722223877906799E-2,"ATR"]
[{"$f":" CONCATENATE(VLOOKUP(B778,esc,2,0),\" - \",VLOOKUP(C778,esc,2,0))","v":"HUAHINE - TAHITI"},"HUH","PPT",{"$f":"CONCATENATE(B778,C778)","v":"HUHPPT"},"Sunday / Dimanche",0.71180555555555547,0.73958333333333337,"462","0",null,2.777777798473835E-2,"ATR"]
["TAHITI - RAIATEA","PPT","RFP","PPTRFP","Sunday / Dimanche",0.75347222222222221,0.78472222222222221,"306","0","Except. 28nov; 05dec; 16,23,30jan; 06,13feb; 06,13mar",3.125E-2,"ATR"]
["HUAHINE - RAIATEA","HUH","RFP","HUHRFP","Sunday / Dimanche",0.80555555555555547,0.81944444444444453,"325","0","12,19,26dec; 02,09jan; 20,27feb; 03,10,17apr",1.3888888992369175E-2,"ATR"]
["HUAHINE - TAHITI","HUH","PPT","HUHPPT","Sunday / Dimanche",0.80555555555555547,0.86458333333333337,"325","1","12,19,26dec; 02,09jan; 20,27feb; 03,10,17apr",5.9027776122093201E-2,"ATR"]
["RAIATEA - TAHITI","RFP","PPT","RFPPPT","Sunday / Dimanche",0.83333333333333337,0.86458333333333337,"325","0","12,19,26dec; 02,09jan; 20,27feb; 03,10,17apr",3.125E-2,"ATR"]
["RAIATEA - TAHITI","RFP","PPT","RFPPPT","Sunday / Dimanche",0.79861111111111116,0.82986111111111116,"306","0","Except. 28nov; 05dec; 16,23,30jan; 06,13feb; 06,13mar",3.125E-2,"ATR"]
["RAIATEA - TIKEHAU","RFP","TIH","RFPTIH","Sunday / Dimanche",0.40277777777777773,0.52430555555555558,"0455/0541",null,null,0.12152777777777778,"ATR"]

{"sheet":"Freq","index":2,"n_rows":15,"n_cols":9,"rows_kept":15,"cut":false,"hidden":true,"merged":[]}
[]
[]
["Nombre de Vol(s)","JOUR"]
["Relation","LUN","MAR","MER","JEU","VEN","SAM","DIM","Total"]
["PPTHUH",6,4,3,5,4,6,4,32]
["HUHPPT",5,4,4,4,5,7,3,32]
["PPTRFP",8,8,9,8,10,7,7,57]
["RFPPPT",9,8,9,7,11,8,7,59]
["PPTBOB",10,9,8,9,8,10,9,63]
["BOBPPT",10,8,7,8,8,9,8,58]
["PPTRGI",3,2,2,2,3,4,3,19]
["RGIPPT",3,3,3,3,3,5,4,24]
["PPTTIH",2,1,1,1,1,1,1,8]
["TIHPPT",2,1,1,2,1,2,2,11]
["Total",58,48,47,49,54,59,48,363]